{"text_format":"1","workbook":"xlsx","n_sheets":16,"sheets":["Start","menu","Location","Thermal insulation","summary soft","summary hard","calculation soft","calculation hard","Vokabel","Listen","calc soft_2","calc soft_suction_2","Listen_Wind + Schnee","Lastkombinationen","Schrauben_ESSVE_25","Materialdaten_Holz"],"not_rendered":{"charts":2,"images":33,"macros":1,"external_links":0,"defined_names":301,"comments":5,"pivot_tables":0},"unopened":[],"bounds":{"document_bytes":16777216,"sheet_cells":100000,"rows_first":2000,"rows_last":500,"rows_between":2000,"halvings":0,"cell_chars":16384,"cell_head_chars":4096},"cells_cut":0,"cells_raw":0,"read":"whole","date_system":"1900"}

{"sheet":"Start","index":0,"n_rows":0,"n_cols":0,"rows_kept":0,"cut":false,"hidden":true,"merged":[[5,0,7,4]]}

{"sheet":"menu","index":1,"n_rows":17,"n_cols":6,"rows_kept":17,"cut":false,"hidden":false,"merged":[[6,1,8,5]]}
[]
[]
[]
[]
[]
[]
[null,{"$f":"ml(\"ad_bemessung_menue\",\"Bemessung von Aufdachdämmsystemen auf Grundlage von {2} mit {3}\",\"\",\"ETA-22/0789\",\"EN 1995-1-1\",cv(\"codeCaption\",\"B 1995-1-1\"))","v":"Design of Thermal-Insulation-Systems based on ETA-22/0789 and EN 1995-1-1 with EVS-EN 1995-1-1"}]
[]
[]
[null,null,null,null,null,{"$f":"Version","v":"V 26.03.01"}]
[]
[null,null,{"$f":"ml(\"tc_menü\",\"MENÜ\")","v":"MAIN MENU"}]
[null,null,null,{"$f":"ml(\"ad_standort\",\"Standort\")","v":"Site location"}]
[null,null,null,{"$f":"ml(\"ad_aufdachdaemmung\",\"Aufdachdämmung\")","v":"Thermal Insulation "}]
[null,null,null,{"$f":"ml(\"tc_zusamm2_\",\"Zusammenfassung\")","v":"Result summary"}]
{"$rows_left_out":3}
{"sheet":"Location","index":2,"n_rows":79,"n_cols":7,"rows_kept":79,"cut":false,"hidden":false,"merged":[[6,4,6,5],[34,1,34,5],[70,1,70,5],[5,4,5,5],[33,3,33,5]]}
[{"$f":"ml(\"ad_aufdachstandort\",\"Aufdachdämmsystem - Standort\")","v":"Thermal Insulation - Construction Site "}]
[{"$f":"ml(\"ad_lastannahmen\",\"Lastannahmen für Wind und Schnee\")","v":"Wind and Snow loads"}]
[{"$f":"ml(\"ad_grundlagen_nl\",\"auf Grundlage von {0} und {1}\",\"EN 1991-1-4\",\"EN 1991-1-3\")","v":"Based on EN 1991-1-4 and EN 1991-1-3"},null,null,null,null,{"$f":"Version","v":"V 26.03.01"}]
[]
[{"$f":"ml(\"ad_standort\",\"Standort\")","v":"Site location"}]
[null,{"$f":"ml(\"ad_land\",\"Land\")","v":"Country"},null,null,"Sweden"]
[null,{"$f":"ml(\"ad_stadt\",\"Stadt\")","v":"City"},null,null,"Stockholm"]
[]
[{"$f":"ml(\"ad_dachfo\",\"Dachform\")","v":"Roof shape"}]
[null,{"$f":"ml(\"ad_eingabe_dachgeometrie\",\"↗ Eingabe der Dachgeometrie im Blatt Aufdachdämmung\")","v":"↗ Input of roof geometry in the corresp. worksheet"}]
[]
[null,{"$f":"IF(beta=90,ml(\"ad_shape\",\"Shape\"),ml(\"ad_dachfo\",\"Dachform\"))","v":"Shape"},null,null,{"$f":"'Thermal insulation'!D52","v":"single pitched / flat"}]
[null,{"$f":"IF(beta=90,\nml(\"ad_wand\",\"Wand\"),\nml(\"ad_dachne\",\"Dachneigung\"))","v":"Wall"},null,"β",{"$f":"beta","v":90},"°"]
[null,{"$f":"IF(beta=90,ml(\"ad_battensspacing\",\"Battens spacing\"),ml(\"ad_sparrenabstand\",\"Sparrenabstand\"))","v":"Battens spacing"},null,"b e",{"$f":"b_e","v":0.6},"m"]
[null,{"$f":"IF(beta=90,ml(\"ad_batlen\",\"Battens length\"),ml(\"ad_sparre\",\"Sparrenlänge \"))","v":"Battens length"},null,"b 1",{"$f":"'Thermal insulation'!D56","v":9.8000000000000007},"m"]
{"$rows_left_out":65}
{"sheet":"Thermal insulation","index":3,"n_rows":167,"n_cols":18,"rows_kept":167,"cut":false,"hidden":false,"merged":[[84,14,84,16],[85,14,85,16],[166,0,166,6],[68,1,68,3],[69,1,69,3],[85,1,85,3],[84,1,84,3],[95,2,95,4],[3,1,3,3],[4,1,4,3],[5,1,5,3],[7,1,7,3],[33,1,33,5],[7,5,7,6],[6,1,6,3]]}
[{"$f":"IF(beta=90,\nml(\"ad_fassasys\",\"Fassadensystem\"),\nml(\"ad_aufdachsys\",\"Aufdachdämmsystem\"))\n&\" - \"&\nml(\"ad_abmess_schrau\",\" - Abmessungen und Schraubenauswahl\")","v":"Facade system - Dimensions and Screws"}]
[{"$f":"ml(\"ad_angabenvorbemssung\",\"Angaben zur Vorbemessung\")","v":"Input for preliminary design"}]
[]
[{"$f":"ml(\"tc_bauvor\",\"BAUVORHABEN:\")","v":"PROJECT:"},null,null,null,null,null,"V 26.03.01"]
[{"$f":"ml(\"tc_pos. n\",\"POS. NR.:\")","v":"POS. NO.:"}]
[{"$f":"ml(\"tc_ausgef\",\"AUSGEFÜLLT VON:\")","v":"RESPONSIBLE:"}]
[{"$f":"ml(\"tc_händle\",\"HÄNDLER:\")","v":"AGENT:"}]
[{"$f":"ml(\"ad_geprüft\",\"GEPRÜFT:\")","v":"APPROVED:"},null,null,null,{"$f":"ml(\"ad_datumgr\",\"DATUM:\")","v":"DATE:"},{"$f":"TODAY()","v":"2026-04-10"}]
[]
[]
[{"$f":"ml(\"tc_allgem\",\"ALLGEMEINE ANGABEN:\")","v":"GENERAL INFORMATION:"}]
[]
[]
[]
[]
{"$rows_left_out":153}
{"sheet":"summary soft","index":4,"n_rows":62,"n_cols":8,"rows_kept":62,"cut":false,"hidden":true,"merged":[[3,1,3,7],[4,1,4,7],[14,3,15,7],[44,0,44,6]]}
[{"$f":"ml(\"ad_aufdachdaemmung_zusammenfassung\",\"Aufdachdämmsystem - Zusammenfassung\")","v":"Thermal Insulation - Summary"}]
[{"$f":"ml(\"ad_zusamm_weich\",\"Zusammenfassung für Systeme mit weicher Dämmung\")","v":"Summary for constructions with soft insulation"}]
[null,null,null,null,null,null,null,{"$f":"Version","v":"V 26.03.01"}]
[{"$f":"ml(\"ad_bauvorhaben\",\"Bauvorhaben\")","v":"Project"},{"$f":"IF('Thermal insulation'!B3=\"\",\"\",'Thermal insulation'!B3)","v":""}]
[{"$f":"ml(\"tc_pos.nr\",\"Pos.Nr.:\")","v":"Pos. No.:"},{"$f":"IF('Thermal insulation'!B4=\"\",\"\",'Thermal insulation'!B4)","v":""}]
[]
[{"$f":"IF(beta=90,ml(\"ad_dachge2\",\"Geometrie\",ml(\"ad_dachge\",\"Dachgeometrie\")))","v":"Dimensions"}]
[{"$f":"'Thermal insulation'!B52","v":"Shape"},null,null,{"$f":"'Thermal insulation'!D52","v":"single pitched / flat"}]
[{"$f":"'Thermal insulation'!B56","v":"Wall height"},null,"b 1",{"$f":"'Thermal insulation'!D56","v":9.8000000000000007},"m"]
[{"$f":"'Thermal insulation'!B57","v":"Wall length"},null,"b 2",{"$f":"'Thermal insulation'!D57","v":12},"m"]
[{"$f":"Location!B14","v":"Battens spacing"},null,"b e",{"$f":"b_e","v":0.6},"m"]
[{"$f":"'Thermal insulation'!B53","v":"Wall"},null,"β",{"$f":"beta","v":90},"°"]
[{"$f":"'Thermal insulation'!B58","v":"Wall area"},null,null,{"$f":"D9*D10","v":117.60000000000001},"m2"]
[]
[{"$f":"ml(\"ad_befestigunsvariante\",\"Befestigungsvariante\")","v":"Fixing method"},null,null,{"$f":"vba_daemmungTyp","v":"Method 2 - Hard Insulation / one direction of inclination of the screws"}]
{"$rows_left_out":48}
{"sheet":"summary hard","index":5,"n_rows":87,"n_cols":8,"rows_kept":87,"cut":false,"hidden":false,"merged":[[13,3,14,7],[2,2,2,7],[3,2,3,7],[74,0,74,6]]}
[{"$f":"ml(\"ad_aufdachdaemmung_zusammenfassung\",\"Aufdachdämmsystem - Zusammenfassung\")","v":"Thermal Insulation - Summary"}]
[null,null,null,null,null,null,null,{"$f":"Version","v":"V 26.03.01"}]
[{"$f":"ml(\"ad_bauvorhaben\",\"Bauvorhaben\")","v":"Project"},null,{"$f":"IF('Thermal insulation'!B3=\"\",\"\",'Thermal insulation'!B3)","v":""}]
[{"$f":"ml(\"tc_pos.nr\",\"Pos.Nr.:\")","v":"Pos. No.:"},null,{"$f":"IF('Thermal insulation'!B4=\"\",\"\",'Thermal insulation'!B4)","v":""}]
[]
[{"$f":"IF(beta=90,ml(\"ad_dachge2\",\"Geometrie\",ml(\"ad_dachge\",\"Dachgeometrie\")))","v":"Dimensions"}]
[{"$f":"'Thermal insulation'!B52","v":"Shape"},null,null,{"$f":"'Thermal insulation'!D52","v":"single pitched / flat"}]
[{"$f":"'Thermal insulation'!B56","v":"Wall height"},null,"b 1",{"$f":"'Thermal insulation'!D56","v":9.8000000000000007},"m"]
[{"$f":"'Thermal insulation'!B57","v":"Wall length"},null,"b 2",{"$f":"'Thermal insulation'!D57","v":12},"m"]
[{"$f":"Location!B14","v":"Battens spacing"},null,"b e",{"$f":"b_e","v":0.6},"m"]
[{"$f":"'Thermal insulation'!B53","v":"Wall"},null,"β",{"$f":"beta","v":90},"°"]
[{"$f":"'Thermal insulation'!B58","v":"Wall area"},null,null,{"$f":"D8*D9","v":117.60000000000001},"m2"]
[]
[{"$f":"ml(\"ad_befestigunsvariante\",\"Befestigungsvariante\")","v":"Fixing method"},null,null,{"$f":"vba_daemmungTyp","v":"Method 2 - Hard Insulation / one direction of inclination of the screws"}]
[]
{"$rows_left_out":73}
{"sheet":"calculation soft","index":6,"n_rows":91,"n_cols":12,"rows_kept":91,"cut":false,"hidden":true,"merged":[[3,1,3,7],[4,1,4,7]]}
[{"$f":"ml(\"ad_aufdac\",\"Aufdachdämmsystem: Berechnungsdetails und Nachweise\")","v":"Thermal Insulation system: Calculation Details and Design"}]
[{"$f":"ml(\"ad_auf gr\",\"auf Grundlage von  {2} mit {3}\", \"Z-9.1-509\",\"ETA-12/0373\",\"EN 1995-1-1\",\"B 1995-1-1\")","v":"based on ETA-12/0373 and EN 1995-1-1 with B 1995-1-1"}]
[null,null,null,null,null,null,null,null,null,null,{"$f":"Version","v":"V 26.03.01"}]
[{"$f":"ml(\"ad_bauvorhaben\",\"Bauvorhaben\")","v":"Project"},{"$f":"IF('Thermal insulation'!B4=\"\",\"\",'Thermal insulation'!B4)","v":""}]
[{"$f":"ml(\"tc_pos.nr\",\"Pos.Nr.:\")","v":"Pos. No.:"},{"$f":"IF('Thermal insulation'!B5=\"\",\"\",'Thermal insulation'!B5)","v":""}]
[]
[{"$f":"ml(\"tc_lastzu\",\"Lastzusammenstellung - Lastfallkombinationen\")","v":"Load combinations"}]
[]
[{"$f":"ml(\"tc_berech\",\"Berechnungswerte für Eigengewicht\")","v":"Calculation values of dead loads"}]
[]
[null,null,null,{"$f":"ml(\"ad_rohdic\",\"Rohdichte\")","v":"Bulk Density"},350,"kg/m3"]
[]
[null,null,null,null,null,"[KN/m]","​ɣ​","kmod","ψ0"]
[{"$f":"'Thermal insulation'!$F$39","v":"Covering and lathing"},null,null,null,"g1 k",{"$f":"gk*b_e","v":0.18}]
[{"$f":"ml(\"ad_dämmun1\",\"Dämmung + Konterlatte/Grundlatte\")","v":"Insulation + Counter-Batten"},null,null,null,"g2 k",{"$f":"(vba_g2k+vba_g3k)*b_e","v":5.0249999999999996E-2}]
{"$rows_left_out":77}
{"sheet":"calculation hard","index":7,"n_rows":96,"n_cols":12,"rows_kept":96,"cut":false,"hidden":false,"merged":[[3,1,3,7],[4,1,4,7]]}
[{"$f":"ml(\"ad_aufdac\",\"Aufdachdämmsystem: Berechnungsdetails und Nachweise\")","v":"Thermal Insulation system: Calculation Details and Design"}]
[{"$f":"ml(\"ad_bem2\",\"auf Grundlage von {1} und {2} mit {3}\",\"Z-9.1-509\",\"ETA-12/373\",\"EN 1995-1-1\",\"B 1995-1-1\")","v":"based on ETA-12/373 and EN 1995-1-1 with B 1995-1-1"}]
[null,null,null,null,null,null,null,null,null,null,{"$f":"Version","v":"V 26.03.01"}]
[{"$f":"ml(\"ad_bauvorhaben\",\"Bauvorhaben\")","v":"Project"},{"$f":"IF('Thermal insulation'!B4=\"\",\"\",'Thermal insulation'!B4)","v":""}]
[{"$f":"ml(\"tc_pos.nr\",\"Pos.Nr.:\")","v":"Pos. No.:"},{"$f":"IF('Thermal insulation'!B5=\"\",\"\",'Thermal insulation'!B5)","v":""}]
[]
[{"$f":"ml(\"tc_lastzu\",\"Lastzusammenstellung - Lastfallkombinationen\")","v":"Load combinations"}]
[]
[{"$f":"ml(\"tc_berech\",\"Berechnungswerte für Eigengewicht\")","v":"Calculation values of dead loads"}]
[]
[null,null,null,{"$f":"ml(\"ad_rohdic\",\"Rohdichte\")","v":"Bulk Density"},350,"kg/m3"]
[]
[null,null,null,null,null,"[KN/m]","​ɣ​","kmod","ψ0"]
[{"$f":"'Thermal insulation'!$F$39","v":"Covering and lathing"},null,null,null,"g1 k",{"$f":"gk*b_e","v":0.18}]
[{"$f":"ml(\"ad_dämmun1\",\"Dämmung + Konterlatte\")","v":"Insulation + Counter-Batten"},null,null,null,"g2 k",{"$f":"(vba_g2k+vba_g3k)*b_e","v":5.0249999999999996E-2}]
{"$rows_left_out":82}
{"sheet":"Vokabel","index":8,"n_rows":872,"n_cols":14,"rows_kept":872,"cut":false,"hidden":true,"merged":[]}
["Nationale Festlegungen"]
["Schlüssel","AT","GB","IT","DE","EE"]
["tc_alpha_cc",1,0.85,0.85,0.85,0.85,null,"long-term effects on the compressive strength"]
["tc_gamM_C",1.3,1.3,1.5,1.3,1.3,null,"Partial material safety factor - Solid Timber"]
["tc_gamM_concr",1.5,1.5,1.5,1.5,1.5,null,"Partial material safety factor - Concrete"]
["tc_gamM_GL",1.25,1.25,1.45,1.25,1.25,null,"Partial material safety factor - Glulam"]
["tc_gamM_stahl",1.1499999999999999,1.1499999999999999,1.1499999999999999,1.1499999999999999,1.1499999999999999,null,"Partial material safety factor - Steel"]
["codeCaption","ON B 1995-1-1","BS NA 1995-1-1","UNI EN 1995-1-1","DIN NA 1995-1-1","EVS-EN 1995-1-1"]
["tc_gamM_V",1.3,1.3,1.5,1.3,1.3,null,"Material safety - Steel Connections"]
[]
["Vokabel"]
[null,null,null,null,null,"Estonia","Poland","Sweden","Norway","Finland","Latvia","Lithuania"]
["Deepl-Sprachkürzel",null,null,null,null,"ET"]
["Schlüssel","DE","EN","IT","FR","EE","PL","SE","NO","FI","LV","LT","CZ","Foglio di ingresso"]
["250425_a","Die Gewindelänge von Schraube {0} in der Konterlatte ist zu gering","The thread length of screw {0} in the counter plate is too short",null,null,"Kruvi {0} keermepikkus vastusplaadis on liiga lühike."]
{"$rows_left_out":858}
{"sheet":"Listen","index":9,"n_rows":167,"n_cols":42,"rows_kept":167,"cut":false,"hidden":true,"merged":[[117,2,117,4],[40,11,40,18],[3,17,3,20],[7,1,7,7],[40,8,40,10],[41,8,41,10],[41,15,41,17],[41,11,41,14]]}
["Listen für das Modul Aufdachdämmung"]
[]
[]
[null,"lst_DaemmTyp",null,null,null,null,null,null,null,null,null,null,null,null,null,null,null,"KONTERLATTE"]
[{"$f":"MATCH('Thermal insulation'!B69,lst_DaemmTyp)","v":1},{"$f":"ml(\"ad_dämm1\",\"Druckfeste Dämmung\")","v":"Hard Insulation"},null,null,null,null,null,null,null,null,null,null,null,null,null,null,null,"gk2 [KN/m2]","fm,k [N/mm2]",null,"E0,mean [N/mm2]"]
[null,{"$f":"ml(\"ad_dämm2\",\"Weiche Dämmung\")","v":"Soft Insulation"},null,null,null,null,null,null,null,null,null,null,null,null,null,null,null,{"$f":"(b_kl*h_kl/100^2)/b_e*3.5","v":8.7500000000000008E-3},{"$f":"INDEX(data_KL,index_KL,1)","v":24},null,{"$f":"INDEX(data_KL,index_KL,2)","v":11000}]
[]
[null,"DÄMMUNG"]
[null,"Produkt","γ [KN/m³]","σ10% [N/mm2]","d_Dä [mm]",null,"E-Modul [N/mm2]","Stauchung 10% [mm]",null,"gkfl [kN/m³]","gk2 [KN/m2]"]
[null,{"$f":"INDEX(CHOOSE(index_DaemmTyp,lst_DaemmHart,lst_DaemmWeich),CHOOSE(index_DaemmTyp,A15,A34),1)","v":"Soft wood fibre insulation"},{"$f":"INDEX(CHOOSE(index_DaemmTyp,data_DaemmHart,data_DaemmWeich),CHOOSE(index_DaemmTyp,$A$15,$A$34),1)","v":3},{"$f":"INDEX(CHOOSE(index_DaemmTyp,data_DaemmHart,data_DaemmWeich),CHOOSE(index_DaemmTyp,$A$15,$A$34),2)","v":0.2},{"$f":"INDEX(CHOOSE(index_DaemmTyp,data_DaemmHart,data_DaemmWeich),CHOOSE(index_DaemmTyp,$A$15,$A$34),3)","v":60},null,{"$f":"INDEX(CHOOSE(index_DaemmTyp,data_DaemmHart,data_DaemmWeich),CHOOSE(index_DaemmTyp,$A$15,$A$34),5)","v":2.8},{"$f":"INDEX(CHOOSE(index_DaemmTyp,data_DaemmHart,data_DaemmWeich),CHOOSE(index_DaemmTyp,$A$15,$A$34),5)","v":2.8}]
[]
[]
[null,null,"data_DaemmHart"]
[null,"lst_DaemmHart","gk2 [KN/m2]","σ10% [N/mm2]","d_Dä [mm]",null,"E-Modul [N/mm2]","Stauchung 10% [mm]"]
[{"$f":"MATCH('Thermal insulation'!$B$70,lst_DaemmHart,0)","v":1},{"$f":"ml(\"lst_holzwung\", \"Holzweichfaserdämmung\")","v":"Soft wood fibre insulation"},3,0.2,60,null,2.8,{"$f":"E15*0.1","v":6},null,3,0.18]
{"$rows_left_out":153}
{"sheet":"calc soft_2","index":10,"n_rows":71,"n_cols":18,"rows_kept":71,"cut":false,"hidden":true,"merged":[]}
["Unendliche Konterlatte/Grundlatte mit zwei unterschiedlich geneigten Schrauben"]
["Für die Berechnung von Konterlatten mit druckweichen Dämmungen und für die Berechnung von Windsogkräften bei druckfesten Dämmungen"]
[null,"q d",{"$f":"qd_schräg","v":0.31083749999999999},"KN/m"]
[null,"beta",{"$f":"beta","v":90},"°"]
["Einwirkungen"]
["LF 1","q _|_",{"$f":"C3*COS(RADIANS(C4))","v":1.9041104142632909E-17},"kN/m","quer zur Konterlatte/Grundlatte"]
["LF 2","q //",{"$f":"-C3*SIN(RADIANS(C4))","v":-0.31083749999999999},"kN/m","in Richtung der Konterlatte/Grundlatte",null,null,null,null,{"$f":"q_DLT","v":1.9041104142632909E-17}]
[]
["Längen an der Konterlatte/Grundlatte"]
[null,"l1",{"$f":"abstand_b/100","v":0.05},"m","kurzes Feld (in Zulassung als B bezeichnet <= 50 mm)"]
[null,"l2",{"$f":"abstand_a/100","v":1.75},"m","langes Feld (in Zulassung als A bezeichnet)"]
["Dämmung und Schraubenneigungen"]
[null,"h D",{"$f":"vba_dDAE/10","v":27},"cm","Höhe der Dämmung (und allfälliger Schalung)"]
[null,"alpha 1",{"$f":"alpha_1_weich","v":60},"°","Neigung der Talschraube gegenüber dem Sparren"]
[null,"alpha 2",{"$f":"alpha_2_weich","v":60},"°","Neigung der Bergschraube gegenüber dem Sparren"]
{"$rows_left_out":57}
{"sheet":"calc soft_suction_2","index":11,"n_rows":71,"n_cols":18,"rows_kept":71,"cut":false,"hidden":true,"merged":[]}
["Unendliche Konterlatte/Grundlatte mit zwei unterschiedlich geneigten Schrauben"]
["Für die Berechnung von Konterlatten/Grundlatten mit druckweichen Dämmungen und für die Berechnung von Windsogkräften bei druckfesten Dämmungen"]
[null,"q d",{"$f":"qd_schräg_sog","v":-1.7712038894252522},"KN/m"]
[null,"beta",{"$f":"beta","v":90},"°"]
["Einwirkungen"]
["LF 1","q _|_",{"$f":"C3*COS(RADIANS(C4))","v":-1.084993854228743E-16},"kN/m","quer zur Konterlatte/Grundlatte"]
["LF 2","q //",{"$f":"-Lastkombinationen!C45*(vba_g2k+vba_g3k)*b_e*SIN(RADIANS(C4))","v":-4.5224999999999994E-2},"kN/m","in Richtung der Konterlatte/Grundlatte"]
[]
["Längen an der Konterlatte/Grundlatte"]
[null,"l1",{"$f":"abstand_b/100","v":0.05},"m","kurzes Feld (in Zulassung als B bezeichnet <= 50 mm)"]
[null,"l2",{"$f":"abstand_a/100","v":1.75},"m","langes Feld (in Zulassung als A bezeichnet)"]
["Dämmung und Schraubenneigungen"]
[null,"h D",{"$f":"vba_dDAE/10","v":27},"cm","Höhe der Dämmung (und allfälliger Schalung)"]
[null,"alpha 1",{"$f":"alpha_1_weich","v":60},"°","Neigung der Talschraube gegenüber dem Sparren"]
[null,"alpha 2",{"$f":"alpha_2_weich","v":60},"°","Neigung der Bergschraube gegenüber dem Sparren"]
{"$rows_left_out":57}
{"sheet":"Listen_Wind + Schnee","index":12,"n_rows":124,"n_cols":13,"rows_kept":124,"cut":false,"hidden":true,"merged":[[1,1,1,10],[2,1,2,4],[2,5,2,8],[2,9,2,10],[14,1,14,10],[15,0,16,0],[15,1,15,4],[15,5,15,8],[15,9,15,10],[2,0,3,0]]}
[]
[null,"Druckbeiwerte Satteldach (B 1991-1-4)"]
["Neigungswinkel [°]","Außendruckbeiwerte cpe,1 negativ (Sog)",null,null,null,"Außendruckbeiwerte cpe,1 positiv (Druck)",null,null,null,"Innendruckbeiwerte\n(für alle Bereiche)"]
[null,"H,I","G","J","F","H,I","G","J","F","cpi (Sog)","cpi (Druck)"]
[0,-1.2,-2,-0.6,-2.5,0,0,0.2,0,-0.3,0.2]
[5,-1.2,-2,-0.6,-2.5,0,0,0.2,0]
[15,-1.2,-2,-1.5,-2,0.2,0.2,0,0.2,null,null,null,{"$f":"(D5+D7)/2","v":-1.05}]
[30,-1.2,-2,-0.5,-1.5,0.4,0.7,0,0.7]
[45,-1.2,-2,-0.3,-1.5,0.6,0.7,0,0.7]
[60,-1,-2,-0.3,-1.5,0.7,0.7,0,0.7]
[75,-1,-2,-0.3,-1.5,0,0.8,0,0.8]
[90,-1,-2,-0.3,-1.5,0,0.8,0,0.8]
[]
[]
[null,"Druckbeiwerte Pultdach (B 1991-1-4)"]
{"$rows_left_out":110}
{"sheet":"Lastkombinationen","index":13,"n_rows":46,"n_cols":21,"rows_kept":46,"cut":false,"hidden":true,"merged":[[25,14,25,20]]}
[]
[null,null,null,null,null,null,null,null,null,null,"lt. EN 1991-1-1:2011 3.3.2(1) müssen auf Dächern Nutzlasten nicht in Kombination mit Schneelasten und/oder Windeinwirkungen angesetzt werden"]
[null,null,null,null,null,null,null,null,null,null,"lt EN 1991-1-1:2011 3.1.3(2) kmod mit kürzerster Lasteinwirkungsdauer"]
[]
[]
[null,"Lastkombination - Lasten parallel zur Dachfläche ",null,null,null,null,"Lasten parallel zum Bauteil lt. Ingenieurholzbau"]
[null,null,"g","n","s","w D","k mod","q d","q d / kmod",null,null,"Umrechnungsfaktor Lasten parallel zur Dachfläche"]
[{"$f":"MATCH(I12,I8:I11,0)","v":1},"g",1.35,null,null,null,0.6,{"$f":"(C8*(gk+vba_g2k+vba_g3k)*gk_pa)*b_e","v":0.31083749999999999},{"$f":"H8/G8","v":0.51806249999999998},null,null,"Eigengewicht","gk",{"$f":"SIN(beta*PI()/180)","v":1}]
[null,"g+n",1.35,1.5,null,null,0.9,{"$f":"(C9*(gk+vba_g2k+vba_g3k)*gk_pa+D9*nk*nk_pa)*b_e","v":0.31083750000000004},{"$f":"H9/G9","v":0.34537500000000004},null,null,"Schnee","sk",{"$f":"SIN(beta*PI()/180)*COS(beta*PI()/180)","v":6.1257422745431001E-17}]
[null,"g+s",1.35,null,1.5,null,{"$f":"IF(index_sHöhe=1,0.8,0.9)","v":0.9},{"$f":"(C10*(gk+vba_g2k+vba_g3k)*gk_pa+E10*sk*sk_pa)*b_e","v":0.31083750000000004},{"$f":"H10/G10","v":0.34537500000000004},null,null,"Nutzlast","nk",{"$f":"SIN(beta*PI()/180)*COS(beta*PI()/180)","v":6.1257422745431001E-17}]
[null,"g+s+(n)",1.35,{"$f":"1.5*0","v":0},1.5,null,0.9,{"$f":"(C11*(gk+vba_g2k+vba_g3k)*gk_pa+D11*nk*nk_pa+E11*sk*sk_pa)*b_e","v":0.31083750000000004},{"$f":"H11/G11","v":0.34537500000000004}]
[null,null,null,null,null,null,null,null,{"$f":"MAX(I8:I11)","v":0.51806249999999998},"KN/m"]
[]
[]
[null,"Lastkombination - Lasten normal zur Dachfläche (Winddruck)",null,null,null,null,"Lasten normal zum Bauteil lt. Ingenieurholzbau"]
{"$rows_left_out":32}
{"sheet":"Schrauben_ESSVE_25","index":14,"n_rows":316,"n_cols":45,"rows_kept":316,"cut":false,"hidden":true,"merged":[]}
["Typen"]
[]
[{"$f":"MATCH(vba_screwType,slst_screwtypes,0)","v":5},null,null,"sd",null,null,{"$f":"\"sdat_\"&index_variante&\"_\"&index_screwtype","v":"sdat_1_5"},null,"Stardrive"]
[{"$f":"MATCH(vba_screwType_2,slst_screwtypes,0)","v":1},null,null,"ra",null,null,null,null,"Rapid"]
["Typenliste",null,"slst_screwtypes_1","slst_screwtypes_1_keys",null,null,"slst_screwtypes_2","slst_screwtypes_2_keys",null,"Spalte AQ \"42\" =  Einteilung geeignet für Dämmung: hart=fest (H) bzw. weich (W) bzw. beide (H+W)",null,null,null,null,null,null,null,null,null,null,null,null,null,null,null,null,null,null,null,null,null,null,null,null,null,null,null,null,null,null,null,null,null,null,"Hilfsspalte - wieder löschen!"]
[null,1,"StarDrive GPR TG Senk",null,null,1,"Essve CY-FT (fullthread, cylinder head)","ad_type_C-FT",null,"statt 2x die gleichen Schrauben mit Aufteilung entspr. Spalte A",null,null,null,null,null,null,null,null,null,null,null,null,null,null,null,null,null,null,null,null,null,null,null,null,null,null,null,null,null,null,null,null,null,null,"neue Schrauben"]
[null,2,"StarDrive GPR TG TK",null,null,2,"Essve CY-FT (fullthread, cylinder head)","ad_type_CY-FT"]
[null,3,"Essve C-PT (partial thread, countersunk head)","ad_type_C-PT",null,3,"Essve CY-DT (double thread, cylinder head - thermal)","ad_type_CY-DT"]
[null,4,"Essve W-LF (partial thread, washer head)","ad_type_W-LF",null,null,"StarDrive VG - ersetzt durch Rapid"]
[null,5,"Essve C-FH (partial thread, washer countersunk)","ad_type_C-FH"]
[null,6,"Essve C-FT (fullthread, countersunk head)","ad_type_C-FT"]
[null,7,"Essve CY-FT (fullthread, cylinder head)","ad_type_CY-FT"]
[null,8,"Essve CY-DT (double thread, cylinder head - thermal)","ad_type_CY-DT"]
[]
[]
{"$rows_left_out":302}
{"sheet":"Materialdaten_Holz","index":15,"n_rows":28,"n_cols":30,"rows_kept":28,"cut":false,"hidden":true,"merged":[[18,1,19,1],[18,3,19,3],[20,1,22,1],[20,3,22,3],[1,1,2,3],[1,4,1,15],[1,16,1,22],[1,23,1,29],[3,3,17,3],[4,1,5,1],[6,1,7,1],[10,1,13,1],[14,1,15,1],[16,1,17,1]]}
[]
[null,"Baustoff Holz",null,null,"NADELHOLZ",null,null,null,null,null,null,null,null,null,null,null,"BRETTSCHICHTHOLZ homogen",null,null,null,null,null,null,"BRETTSCHICHTHOLZ kombiniert"]
[null,null,null,null,"C14","C16","C18","C20","C22","C24","C27","C30","C35","C40","C45","C50","GL20h","GL22h","GL24h","GL26h","GL28h","GL30h","GL32h","GL20c","GL22c","GL24c","GL26c","GL28c","GL30c","GL32c"]
[null,"Biegefestigkeit","f m,k","N/mm²",14,16,18,20,22,24,27,30,35,40,45,50,20,22,24,26,28,30,32,20,22,24,26,28,30,32]
[null,"Zugfestigkeit","f t,0,k",null,8,10,11,12,13,14,16,18,21,24,27,30,16,17.600000000000001,19.2,20.8,22.3,24,25.6,15,16,17,19,19.5,19.5,19.5]
[null,null,"f t,90,k",null,0.4,0.4,0.4,0.4,0.4,0.4,0.4,0.4,0.4,0.4,0.4,0.4,0.5,0.5,0.5,0.5,0.5,0.5,0.5,0.5,0.5,0.5,0.5,0.5,0.5,0.5]
[null,"Druckfestigkeit","f c,0,k",null,16,17,18,19,20,21,22,23,25,26,27,29,20,22,24,26,28,30,32,18.5,20,21.5,23.5,24,24.5,24.5]
[null,null,"f c,90,k",null,2,2.2000000000000002,2.2000000000000002,2.2999999999999998,2.4,2.5,2.6,2.7,2.8,2.9,3.1,3.2,2.5,2.5,2.5,2.5,2.5,2.5,2.5,2.5,2.5,2.5,2.5,2.5,2.5,2.5]
[null,"Schubfestigkeit","f v,k",null,2.2999999999999998,2.2999999999999998,2.2999999999999998,2.2999999999999998,2.2999999999999998,2.2999999999999998,2.2999999999999998,2.2999999999999998,2.2999999999999998,2.2999999999999998,2.2999999999999998,2.2999999999999998,2.5,2.5,2.5,2.5,2.5,2.5,2.5,2.5,2.5,2.5,2.5,2.5,2.5,2.5]
[null,"Rollschubfestigkeit","f r,k",null,null,null,null,null,null,null,null,null,null,null,null,null,1.2,1.2,1.2,1.2,1.2,1.2,1.2,1.2,1.2,1.2,1.2,1.2,1.2,1.2]
[null,"Elastizitätsmodul","E 0,mean",null,7000,8000,9000,9500,10000,11000,11500,12000,13000,14000,15000,16000,8400,10500,11500,12100,12600,13600,14200,10400,10400,11000,12000,12500,13000,13500]
[null,null,"E 0.05",null,4700,5400,6000,6400,6700,7400,7700,8000,8700,9400,10000,10700,7000,8800,9600,10100,10500,11300,11800,8600,8600,9100,10000,10400,10800,11200]
[null,null,"E 90,mean",null,230,270,300,320,330,370,380,400,430,470,500,530,300,300,300,300,300,300,300,300,300,300,300,300,300,300]
[null,null,"E 90,.05",null,null,null,null,null,null,null,null,null,null,null,null,null,250,250,250,250,250,250,250,250,250,250,250,250,250,250]
[null,"Schubmodul","G mean",null,440,500,560,590,630,690,720,750,810,880,940,1000,650,650,650,650,650,650,650,650,650,650,650,650,650,650]
{"$rows_left_out":13}