{"text_format":"1","workbook":"xlsx","n_sheets":16,"sheets":["Start","menu","Location","Thermal insulation","summary soft","summary hard","calculation soft","calculation hard","Vokabel","Listen","calc soft_2","calc soft_suction_2","Listen_Wind + Schnee","Lastkombinationen","Schrauben_ESSVE_25","Materialdaten_Holz"],"not_rendered":{"charts":2,"images":33,"macros":1,"external_links":0,"defined_names":301,"comments":5,"pivot_tables":0},"unopened":[],"bounds":{"document_bytes":16777216,"sheet_cells":100000,"rows_first":2000,"rows_last":500,"rows_between":2000,"halvings":0,"cell_chars":16384,"cell_head_chars":4096},"cells_cut":0,"cells_raw":0,"read":"whole","date_system":"1900"}

{"sheet":"Start","index":0,"n_rows":0,"n_cols":0,"rows_kept":0,"cut":false,"hidden":true,"merged":[[5,0,7,4]]}

{"sheet":"menu","index":1,"n_rows":17,"n_cols":6,"rows_kept":17,"cut":false,"hidden":false,"merged":[[6,1,8,5]]}
[]
[]
[]
[]
[]
[]
[null,{"$f":"ml(\"ad_bemessung_menue\",\"Bemessung von Aufdachdämmsystemen auf Grundlage von {2} mit {3}\",\"\",\"ETA-22/0789\",\"EN 1995-1-1\",cv(\"codeCaption\",\"B 1995-1-1\"))","v":"Design of Thermal-Insulation-Systems based on ETA-22/0789 and EN 1995-1-1 with EVS-EN 1995-1-1"}]
[]
[]
[null,null,null,null,null,{"$f":"Version","v":"V 26.03.01"}]
[]
[null,null,{"$f":"ml(\"tc_menü\",\"MENÜ\")","v":"MAIN MENU"}]
[null,null,null,{"$f":"ml(\"ad_standort\",\"Standort\")","v":"Site location"}]
[null,null,null,{"$f":"ml(\"ad_aufdachdaemmung\",\"Aufdachdämmung\")","v":"Thermal Insulation "}]
[null,null,null,{"$f":"ml(\"tc_zusamm2_\",\"Zusammenfassung\")","v":"Result summary"}]
[null,null,null,{"$f":"ml(\"ad_berechnung\",\"Berechnung\")","v":"Calculation"}]
[null,null,{"$f":"IF(AND(ISERR(f1_k),ISERR(f_1_k_weich_druck)),\nml(\"ad_achtung\",\"ACHTUNG! VBA-Funktionen vom System gesperrt. Bitte Arbeitsmappe schließen und nochmals öffnen.\"),\"\")","v":{"$error":"#NAME?"}}]

{"sheet":"Location","index":2,"n_rows":79,"n_cols":7,"rows_kept":79,"cut":false,"hidden":false,"merged":[[6,4,6,5],[34,1,34,5],[70,1,70,5],[5,4,5,5],[33,3,33,5]]}
[{"$f":"ml(\"ad_aufdachstandort\",\"Aufdachdämmsystem - Standort\")","v":"Thermal Insulation - Construction Site "}]
[{"$f":"ml(\"ad_lastannahmen\",\"Lastannahmen für Wind und Schnee\")","v":"Wind and Snow loads"}]
[{"$f":"ml(\"ad_grundlagen_nl\",\"auf Grundlage von {0} und {1}\",\"EN 1991-1-4\",\"EN 1991-1-3\")","v":"Based on EN 1991-1-4 and EN 1991-1-3"},null,null,null,null,{"$f":"Version","v":"V 26.03.01"}]
[]
[{"$f":"ml(\"ad_standort\",\"Standort\")","v":"Site location"}]
[null,{"$f":"ml(\"ad_land\",\"Land\")","v":"Country"},null,null,"Sweden"]
[null,{"$f":"ml(\"ad_stadt\",\"Stadt\")","v":"City"},null,null,"Stockholm"]
[]
[{"$f":"ml(\"ad_dachfo\",\"Dachform\")","v":"Roof shape"}]
[null,{"$f":"ml(\"ad_eingabe_dachgeometrie\",\"↗ Eingabe der Dachgeometrie im Blatt Aufdachdämmung\")","v":"↗ Input of roof geometry in the corresp. worksheet"}]
[]
[null,{"$f":"IF(beta=90,ml(\"ad_shape\",\"Shape\"),ml(\"ad_dachfo\",\"Dachform\"))","v":"Shape"},null,null,{"$f":"'Thermal insulation'!D52","v":"single pitched / flat"}]
[null,{"$f":"IF(beta=90,\nml(\"ad_wand\",\"Wand\"),\nml(\"ad_dachne\",\"Dachneigung\"))","v":"Wall"},null,"β",{"$f":"beta","v":90},"°"]
[null,{"$f":"IF(beta=90,ml(\"ad_battensspacing\",\"Battens spacing\"),ml(\"ad_sparrenabstand\",\"Sparrenabstand\"))","v":"Battens spacing"},null,"b e",{"$f":"b_e","v":0.6},"m"]
[null,{"$f":"IF(beta=90,ml(\"ad_batlen\",\"Battens length\"),ml(\"ad_sparre\",\"Sparrenlänge \"))","v":"Battens length"},null,"b 1",{"$f":"'Thermal insulation'!D56","v":9.8000000000000007},"m"]
[null,{"$f":"IF(beta=90,ml(\"ad_wallen\",\"Wall length\"),ml(\"ad_traufl\",\"Trauflänge\"))","v":"Wall length"},null,"b 2",{"$f":"'Thermal insulation'!D57","v":12},"m"]
[]
[null,{"$f":"ml(\"ad_höhe ü\",\"Höhe über Grund (Firsthöhe)\")","v":"Height above ground (ridge height)"},null,"z",{"$f":"'Thermal insulation'!D54","v":9},"m"]
[]
[{"$f":"ml(\"ad_lastan\",\"LASTANNAHME SCHNEE\")","v":"SNOW LOAD ASSUMPTION"},null,null,{"$f":"ml(\"ad_europe2\",\"European Model (EN 1991-1-3)\")","v":"European Model (EN 1991-1-3)"}]
[null,{"$f":"ml(\"ad_schnee\",\"Schneezone\")","v":"Snow zone"},null,null,"Zone 2",null,{"$f":"ml(\"ad_informy\",\"informativ\")","v":"informative"}]
[null,{"$f":"ml(\"ad_gelaend\",\"Geländehöhe über dem Meer\")","v":"Terrain height above sea level"},null,"A",250,"m",{"$f":"ml(\"ad_informy\",\"informativ\")","v":"informative"}]
[]
[null,{"$f":"ml(\"ad_schneelast_boden\",\"Schneelast auf dem Boden\")","v":"Ground snow load"},null,"s k",2,"kN/m²",{"$f":"ml(\"loc_asDefined\",\"as defined in National Annex\")","v":"as defined in National Annex"}]
[null,{"$f":"ml(\"ad_schnee_abrutschen\",\"Schnee vom Abrutschen behindert\")","v":"Snow sliding is prevented"},null,null,"YES"]
[]
[null,{"$f":"ml(\"ad_formbeiwert_schneelast\",\"Formbeiwert für Schneelasten\")","v":"Shape coefficient for snow loads"},null,"μ1",{"$f":"IF(index_Schneegitter=1,0.8,IF(beta<=30,0.8,IF(beta>=60,0,0.8*(60-beta)/30)))","v":0.8},"[-]"]
[null,"Exposure coefficient",null,"C e",1,null,"5.2 (6)"]
[null,"Thermal coefficient",null,"C t",1,null,"5.2 (7)"]
[null,{"$f":"ml(\"ad_schneelast_dächer\",\"Schneelast auf Dächern\")","v":"Roof snow load"},null,"s D,k",{"$f":"IF(ISNA(vba_sk),0,E27*E24)","v":1.6},"kN/m²"]
[]
[{"$f":"ml(\"ad_lastann_wind\",\"LASTANNAHME WIND\")","v":"WIND LOAD ASSUMPTION"},null,null,{"$f":"ml(\"ad_europe\",\"European Model (EN 1991-1-4)\")","v":"European Model (EN 1991-1-4)"}]
[]
[null,{"$f":"ml(\"ad_geländekategorie\",\"Geländekategorie\")","v":"Terrain category"},null,"I"]
[null,{"$f":"INDEX(data_GK,index_GK,1)","v":"Areas at lakes or flat terrain with negligible vegetation and no obstacles"}]
[null,{"$f":"ml(\"loc_roughlen\",\"Roughness Length\")","v":"Roughness Length"},null,"z 0",{"$f":"INDEX(data_GK,index_GK,2)","v":0.01},"m","4.3.2, Table 4.1"]
[null,{"$f":"ml(\"loc_zmin\",\"Minimum Height\")","v":"Minimum Height"},null,"z min",{"$f":"INDEX(data_GK,index_GK,3)","v":1},"m","4.3.2, Table 4.1"]
[null,{"$f":"ml(\"loc_terrfac\",\"Terrain Factor\")","v":"Terrain Factor"},null,"k r ",{"$f":"0.19*(E36/0.05)^0.07","v":0.16975622176577601},null,"4.3.2, Eq. 4.5"]
[null,{"$f":"ml(\"loc_turbfac\",\"Turbulence factor\")","v":"Turbulence factor"},null,"k I",1,null,"4.4, Note 2"]
[null,{"$f":"ml(\"loc_topof\",\"Topography factor\")","v":"Topography factor"},null,"c 0",1,null,"4.3.3"]
[null,{"$f":"ml(\"loc_terrfac\",\"Terrain Factor\")","v":"Terrain Factor"},null,"c r (z min)",{"$f":"E38*LN(E37/E36)","v":0.78175629136173452},null,"4.3.2, Eq. 4.5"]
[]
[null,{"$f":"ml(\"ad_basisgeschwindigkeit\",\"Basisgeschwindigkeit\")","v":"Basic wind velocity"},null,"v b,0",23,"m/s",{"$f":"ml(\"loc_asDefined\",\"as defined in National Annex\")","v":"as defined in National Annex"}]
[null,{"$f":"ml(\"loc_qbdesc\",\"Basic wind pressure\")","v":"Basic wind pressure"},null,"q b",{"$f":"1/2*1.25*E43^2/1000","v":0.330625},"kN/m²"]
[null,{"$f":"ml(\"loc_meanwind\",\"Mean wind\")","v":"Mean wind"},null,"v m (z min)",{"$f":"E41*wind_c_0*E43","v":17.980394701319895},"m/s"]
[null,{"$f":"ml(\"loc_turbint\",\"Turbulence intensity\")","v":"Turbulence intensity"},null,"I v (z min)",{"$f":"wind_K_I/(wind_c_0*LN(E37/E36))","v":0.21714724095162588}]
[null,{"$f":"ml(\"ad_spigedru\",\"Böengeschwindigkeitsdruck\")","v":"Peak velocity pressure"},null,"q p (z min)",{"$f":"(1+7*E46)*1/2*1.25*E45^2/1000","v":0.50919518546384823},"kN/m²"]
[]
[null,{"$f":"'Thermal insulation'!B54","v":"Ridge height"},null,"z",{"$f":"z_wind","v":9},"m"]
[null,{"$f":"ml(\"loc_terrfac\",\"Terrain Factor\")","v":"Terrain Factor"},null,"c r (z)",{"$f":"IF(E49<E37,E41,$E$38*LN(E49/$E$36))","v":1.1547488339812351}]
[null,{"$f":"ml(\"loc_meanwind\",\"Mean wind\")","v":"Mean wind"},null,"v m (z)",{"$f":"E50*wind_c_0*$E$43","v":26.559223181568406}]
[null,{"$f":"ml(\"loc_turbint\",\"Turbulence intensity\")","v":"Turbulence intensity"},null,"I v (z min)",{"$f":"IF(E49<E37,E46,wind_K_I/(wind_c_0*LN(E49/E36)))","v":0.14700705189760302}]
[null,{"$f":"ml(\"ad_spigedru\",\"Böengeschwindigkeitsdruck\")","v":"Peak velocity pressure"},null,"q p (z)",{"$f":"(1+7*E52)*1/2*1.25*E51^2/1000","v":0.89454741890164247},"kN/m²"]
[]
[]
[{"$f":"ml(\"ad_außendruckbeiwerte\",\"Außendruckbeiwerte {0}\",\"cpe,1\")","v":"External pressure coefficient cpe,1"}]
[]
[null,{"$f":"ml(\"ad_außendruckbeiwerte_einfach\",\"Außendruckbeiwerte nach {0}\",\"B 1991-1-4 (vereinfachte Ermittlung)\")","v":"External pressure coefficient acc. To B 1991-1-4 (simplified)"}]
[null,"H,I","G",{"$f":"IF(index_Dachform=1,\"J\",\"F\")","v":"F"},{"$f":"IF(index_Dachform=1,\"F\",\"-\")","v":"-"}]
[{"$f":"ml(\"ad_sog\",\"Sog\")","v":"Suction"},{"$f":"IF(index_Dachform=1,fh_sverweis($E$13,data_beiwert_sattel,2),fh_sverweis($E$13,data_beiwert_pult,2))","v":-1.3},{"$f":"IF(index_Dachform=1,fh_sverweis($E$13,data_beiwert_sattel,3),fh_sverweis($E$13,data_beiwert_pult,3))","v":-2},{"$f":"IF(index_Dachform=1,fh_sverweis($E$13,data_beiwert_sattel,4),fh_sverweis($E$13,data_beiwert_pult,5))","v":-2},{"$f":"IF(index_Dachform=1,fh_sverweis($E$13,data_beiwert_sattel,5),0)","v":0}]
[{"$f":"ml(\"ad_druck\",\"Druck\")","v":"Pressure"},{"$f":"IF(index_Dachform=1,fh_sverweis($E$13,data_beiwert_sattel,6),fh_sverweis($E$13,data_beiwert_pult,6))","v":0.8},{"$f":"IF(index_Dachform=1,fh_sverweis($E$13,data_beiwert_sattel,7),fh_sverweis($E$13,data_beiwert_pult,7))","v":0.8},{"$f":"IF(index_Dachform=1,fh_sverweis($E$13,data_beiwert_sattel,8),fh_sverweis($E$13,data_beiwert_pult,9))","v":0.8},{"$f":"IF(index_Dachform=1,fh_sverweis($E$13,data_beiwert_sattel,9),0)","v":0}]
[]
[{"$f":"ml(\"ad_innendruckbeiwerte\",\"Innendruckbeiwerte {0};{cpi}\")","v":"Internal pressure coefficient"}]
[]
[null,"H,I","G",{"$f":"IF(index_Dachform=1,\"J\",\"F\")","v":"F"},{"$f":"IF(index_Dachform=1,\"F\",\"-\")","v":"-"}]
[{"$f":"ml(\"ad_sog\",\"Sog\")","v":"Suction"},{"$f":"'Listen_Wind + Schnee'!$J$5","v":-0.3},{"$f":"'Listen_Wind + Schnee'!$J$5","v":-0.3},{"$f":"'Listen_Wind + Schnee'!$J$5","v":-0.3},{"$f":"IF(index_Dachform=1,'Listen_Wind + Schnee'!$J$5,0)","v":0}]
[{"$f":"ml(\"ad_druck\",\"Druck\")","v":"Pressure"},{"$f":"'Listen_Wind + Schnee'!$K$5","v":0.2},{"$f":"'Listen_Wind + Schnee'!$K$5","v":0.2},{"$f":"'Listen_Wind + Schnee'!$K$5","v":0.2},{"$f":"IF(index_Dachform=1,'Listen_Wind + Schnee'!$K$5,0)","v":0}]
[]
[{"$f":"ml(\"ad_windsog_w\",\"Windsog {0}\",\"w S,k\")","v":"Wind suction w S,k"}]
[]
[null,{"$f":"ml(\"ad_windsogspitzenvordach\",\"Windsogspitzen im Vordachbereich werden von den Sparren aufgenommen und betreffen nicht die Konterlatten / Grundlatten.\")","v":"Peak wind suction on porch roofs act on rafters and not on counter-battens"}]
[]
[null,"H,I","G",{"$f":"IF(index_Dachform=1,\"J\",\"F\")","v":"F"},{"$f":"IF(index_Dachform=1,\"F\",\"\")","v":""}]
[null,{"$f":"q_p*(B60-B67)","v":-1.3418211283524637},{"$f":"q_p*(C60-C67)","v":-1.9680043215836136},{"$f":"q_p*(D60-D67)","v":-1.9680043215836136},{"$f":"IF(index_Dachform=1,q_p*(E60-E67),0)","v":0},"kN/m²"]
[]
[{"$f":"ml(\"ad_winddruckw\",\"Winddruck {0}\",\"w Pr,k\")","v":"Wind pressure w Pr,k"}]
[]
[null,"H,I","G",{"$f":"IF(index_Dachform=1,\"J\",\"F\")","v":"F"},{"$f":"IF(index_Dachform=1,\"F\",\"\")","v":""}]
[null,{"$f":"q_p*(B61-B66)","v":0.9840021607918068},{"$f":"q_p*(C61-C66)","v":0.9840021607918068},{"$f":"q_p*(D61-D66)","v":0.9840021607918068},{"$f":"IF(index_Dachform=1,q_p*(E61-E66),\"\")","v":""},"kN/m²"]

{"sheet":"Thermal insulation","index":3,"n_rows":167,"n_cols":18,"rows_kept":167,"cut":false,"hidden":false,"merged":[[84,14,84,16],[85,14,85,16],[166,0,166,6],[68,1,68,3],[69,1,69,3],[85,1,85,3],[84,1,84,3],[95,2,95,4],[3,1,3,3],[4,1,4,3],[5,1,5,3],[7,1,7,3],[33,1,33,5],[7,5,7,6],[6,1,6,3]]}
[{"$f":"IF(beta=90,\nml(\"ad_fassasys\",\"Fassadensystem\"),\nml(\"ad_aufdachsys\",\"Aufdachdämmsystem\"))\n&\" - \"&\nml(\"ad_abmess_schrau\",\" - Abmessungen und Schraubenauswahl\")","v":"Facade system - Dimensions and Screws"}]
[{"$f":"ml(\"ad_angabenvorbemssung\",\"Angaben zur Vorbemessung\")","v":"Input for preliminary design"}]
[]
[{"$f":"ml(\"tc_bauvor\",\"BAUVORHABEN:\")","v":"PROJECT:"},null,null,null,null,null,"V 26.03.01"]
[{"$f":"ml(\"tc_pos. n\",\"POS. NR.:\")","v":"POS. NO.:"}]
[{"$f":"ml(\"tc_ausgef\",\"AUSGEFÜLLT VON:\")","v":"RESPONSIBLE:"}]
[{"$f":"ml(\"tc_händle\",\"HÄNDLER:\")","v":"AGENT:"}]
[{"$f":"ml(\"ad_geprüft\",\"GEPRÜFT:\")","v":"APPROVED:"},null,null,null,{"$f":"ml(\"ad_datumgr\",\"DATUM:\")","v":"DATE:"},{"$f":"TODAY()","v":"2026-04-10"}]
[]
[]
[{"$f":"ml(\"tc_allgem\",\"ALLGEMEINE ANGABEN:\")","v":"GENERAL INFORMATION:"}]
[]
[]
[]
[]
[]
[]
[]
[]
[]
[]
[]
[]
[]
[]
[]
[]
[]
[]
[]
[]
[]
[{"$f":"ml(\"ad_befestigunsvariante\",\"Befestigungsvariante\")","v":"Fixing method"}]
[{"$f":"MATCH(vba_daemmungTyp,Ist_Variante,0)","v":1},"Method 2 - Hard Insulation / one direction of inclination of the screws"]
[]
[]
[{"$f":"ml(\"tc_belast\",\"BELASTUNG:\")","v":"LOADS:"},{"$f":"ml(\"ad_standort1\",\"↘ Standortangabe im Blatt Standort\")","v":"Input of site location in the corresp. worksheet"}]
[null,{"$f":"IF(beta=90,ml(\"ad_fassgew\",\"Fassadengewicht\"),ml(\"ad_dachei\",\"Dacheindeckung\"))","v":"Facade weight"},null,"Metal"]
[null,{"$f":"ml(\"tc_eigeng1_\",\"Eigengewicht\")","v":"Dead load"},"g 1,k",{"$f":"INDEX(data_Dacheindeckung,index_Dacheindeckung,1)","v":0.3},"kN/m²",{"$f":"IF(beta=90,ml(\"ad_dachei3\",\"Deckschale inkl. Lattung\"),ml(\"ad_dachei\",\"Dacheindeckung inkl. Lattung\"))","v":"Covering and lathing"}]
[]
[null,{"$f":"ml(\"tc_nutzla3__\",\"Nutzlast\")","v":"Live load"},"q k",1,"kN/m²",{"$f":"ml(\"ad_nutzlastkategorie\",\"Nutzlastkategorie H: Dächer lt. EN 1991-1-1\")","v":"Live load category H: roofs acc. to EN 1991-1-1"}]
[null,null,"Q k",1.5,"kN"]
[]
[null,{"$f":"ml(\"ad_schneelast\",\"Schneelast\")","v":"Snow load"},"s D,k",{"$f":"s_Dk","v":1.6},"kN/m²"]
[null,null,null," ≤ 1000 m"]
[]
[null,{"$f":"ml(\"ad_winddruck\",\"Winddruck\")","v":"Wind pressure"},"w D,k",{"$f":"MAX(Winddruckliste)","v":0.9840021607918068},"kN/m²",{"$f":"IF(wdk=MAX(Winddruckliste),\nml(\"ad_exwwd\",\"Extremwert Winddruck\"),ml(\"ad_eigdef\",\"eigene Definition\"))","v":"Peak wind pressure"}]
[null,{"$f":"ml(\"ad_windsog\",\"Windsog\")","v":"Wind suction"},"w S,k",{"$f":"MIN(Windsogliste)","v":-1.9680043215836136},"kN/m²",{"$f":"IF(wsk=MIN(Windsogliste),ml(\"ad_exwws\",\"Extremwert Windsog\"),ml(\"ad_eigdef\",\"eigene Definition\"))","v":"Peak wind suction"}]
[]
[{"$f":"ml(\"tc_system\",\"SYSTEM:\")","v":"SYSTEM:"}]
[{"$f":"IF(beta=90,\nml(\"ad_fassa\",\"Fassade\"),\nml(\"ad_dachfo\",\"Dachform\"))","v":"Facade"}]
[{"$f":"MATCH(vba_Dachform,Ist_Dachform_1,0)","v":2},{"$f":"IF(beta=90,ml(\"ad_shape\",\"Shape\"),ml(\"ad_dachfo\",\"Dachform\"))","v":"Shape"},null,"single pitched / flat"]
[null,{"$f":"IF(beta=90,\nml(\"ad_wand\",\"Wand\"),\nml(\"ad_dachne\",\"Dachneigung\"))","v":"Wall"},"β",90,"°"]
[null,{"$f":"ml(\"ad_firsth\",\"Firsthöhe\")","v":"Ridge height"},"z",9,"m"]
[null,{"$f":"IF(beta=90,ml(\"ad_battensspacing\",\"Battens spacing\"),ml(\"ad_sparrenabstand\",\"Sparrenabstand\"))","v":"Battens spacing"},"b e",0.6,"m"]
[null,{"$f":"IF(beta=90,ml(\"ad_wandh\",\"Wandhöhe\"),ml(\"ad_sparre2\",\"Gesamtlänge Sparren\"))","v":"Wall height"},"b 1",9.8000000000000007,"m",{"$f":"IF(beta=90,\"\",\nCHOOSE(position_Dachform,\nml(\"ad_schräge1\",\"(schräge Länge beider Sparren)\"),\nml(\"ad_schräge2\",\"(schräge Länge eines Sparrens)\")))","v":""}]
[null,{"$f":"IF(beta=90,ml(\"ad_wandl\",\"Wandlänge\"),ml(\"ad_traufl\",\"Trauflänge\"))","v":"Wall length"},"b 2",12,"m"]
[null,{"$f":"IF(beta=90,ml(\"ad_wandf\",\"Wandfläche\"),ml(\"ad_dachfl\",\"Dachfläche\"))","v":"Wall area"},"A",{"$f":"'summary hard'!D12","v":117.60000000000001},"m²"]
[]
[null,{"$f":"ml(\"ad_standort1\",\"↘ Standortangabe im Blatt Standort\")","v":"Input of site location in the corresp. worksheet"}]
[{"$f":"ml(\"ad_konter_grundl\",\"Konterlatte / Grundlatte (GL)\")","v":"Counter-batten"}]
[null,{"$f":"ml(\"ad_nutzun\",\"Nutzungsklasse\")","v":"Service class"},null,"SC 1",null,{"$f":"ml(\"ad_bautei\",\"Bauteile in offenen, überdachten Konstruktionen\")","v":"Roofed outdoor constructions"}]
[null,{"$f":"ml(\"ad_festig\",\"Festigkeitsklasse\")","v":"Strength class"},null,"C24"]
[]
[null,null,"b",5,"cm",{"$f":"IF(I65,\"\",\"b ≥! \" & J65 &\" cm für d=\" & vba_Schraube_d&\" mm lt. Zulassung\")","v":""},null,null,{"$f":"b_kl>=J65","v":true},{"$f":"IF(vba_Schraube_d<=8,5,IF(vba_Schraube_d<=10,6,8))","v":5}]
[null,null,"h",3,"cm",{"$f":"IF(I66,\"\",\"h ≥! \" & J66 &\" cm für d=\" & vba_Schraube_d&\" mm lt. Zulassung\")","v":""},null,null,{"$f":"h_kl>=J66","v":true},{"$f":"IF(vba_Schraube_d<=8,3,IF(vba_Schraube_d<=10,4,5))","v":3}]
[null,null,"g K,k",{"$f":"KL_gk","v":8.7500000000000008E-3},"kN/m²"]
[{"$f":"ml(\"ad_dämmst\",\"Dämmstoff\")","v":"Insulation"}]
[{"$f":"ml(\"tcf_type\",\"Typ\")","v":"type"},{"$f":"IF(index_variante=1,ml(\"ad_dämm1\",\"Druckfeste Dämmung\"),ml(\"ad_dämm2\",\"Weiche Dämmung\"))","v":"Hard Insulation"}]
[{"$f":"ml(\"ad_produk\",\"Produkt\")","v":"Product"},"Soft wood fibre insulation"]
[]
[{"$f":"ml(\"ad_dicke\",\"Dicke\")","v":"Thickness"},null,"d ins",250,"mm",null,null,null,{"$f":"IF(index_variante=1,D72<300,D72<400)","v":true}]
[{"$f":"ml(\"ad_drucks_10\",\"Druckspannung bei 10% Stauchung\")","v":"Compressive stress due to a compression of 10%"},null,"σ 10%",{"$f":"Daemm_stauch","v":0.2},"N/mm2"]
[{"$f":"ml(\"ad_wichte\",\"Wichte der Dämmung\")","v":"Weight density"},null,"γ ins",0.3,"kN/m³"]
[{"$f":"ml(\"ad_gewich\",\"Gewicht der Dämmung\")","v":"Weight of the insulation "},null,"g ins,k",{"$f":"D74*(vba_dDAE2/1000)","v":7.4999999999999997E-2},"kN/m²"]
[{"$f":"ml(\"ad_e-modu\",\"E-Modul\")","v":"Young´s modulus"},null,"E D,c,mean",{"$f":"E_dä","v":2.8},"N/mm2"]
[]
[{"$f":"ml(\"ad_schalu\",\"Schalung\")","v":"Formwork"}]
[null,null,"t s",2,"cm"]
[{"$f":"IF(beta=90,ml(\"ad_sparren_2\",\"Traglatte (zur Kontrolle der Schraubenabmessungen)\"),ml(\"ad_sparren_\",\"Sparren (zur Kontrolle der Schraubenabmessungen)\"))","v":"Batten dimensions (to check screw dim.)"}]
[null,null,"b",6,"cm",{"$f":"IF(I81,\"\",\"b ≥ 6,0 cm lt. Zulassung\")","v":""},null,null,{"$f":"$D$81>=IF(d_schraube>=12,8,6)","v":true}]
[null,null,"h",20,"cm"]
[]
[{"$f":"ml(\"tc_verbin\",\"VERBINDUNGSMITTEL:\")","v":"SCREWS:"},null,null,{"$f":"IF(vba_TypeIndex=2,J153,K121)","v":true},null,null,null,null,null,null,null,null,null,{"$f":"ml(\"ad_windso2\",\"Windsogsicherung über Schrauben rechtwinkelig zur Dachfläche\")","v":"Wind suction securing through screws rectangular to the roof surface"}]
[{"$f":"ml(\"tcf_type\",\"Typ\")","v":"type"},"Essve CY-FT (fullthread, cylinder head)",null,null,{"$f":"ml(INDEX(INDIRECT(\"slst_screwtypes_\" & index_variante & \"_keys\"),index_screwtype),\"\")","v":{"$error":"#NAME?"}},null,null,null,null,null,null,null,null,null,"Essve C-PT (partial thread, countersunk head)"]
[{"$f":"ml(\"ad_schraube\",\"Schraube\")","v":"Screw"},"ESSVE CY-FT  8,0 x 450/427",null,null,null,null,null,{"$f":"ml(\"ad_optimierng\",\"Optimierung\")","v":"Optimise"},null,null,null,null,null,null,"Essve C-PT  8,0 x 300/100"]
[{"$f":"ml(\"ad_anordn\",\"Anordnung\")","v":"Assembly"},{"$f":"INDEX(data_Variante,Listen!$A$59,)","v":"one direction of inclination of the screws"},null,null,null,null,null,null,null,null,null,null,null,null,{"$f":"ml(INDEX(INDIRECT(\"slst_screwtypes_\" & index_variante & \"_keys\"),index_screwtype_2),\"\")","v":{"$error":"#NAME?"}}]
[]
[null,{"$f":"ml(\"ad_schrau\",\"Schraubenabstand\")","v":"Screw distance"},"A",175,"cm",{"$f":"IF(I89,\"\",\"A ≤ 175 cm lt. Zulassung\")","v":""},null,null,{"$f":"abstand_a<=175","v":true}]
[null,null,"B",5,"cm",{"$f":"IF(I90,\"\",\"B ≤ 5,0 cm lt. Zulassung\")","v":""},null,null,{"$f":"abstand_b<=5","v":true}]
[]
[null,{"$f":"ml(\"ad_schrau_n\",\"Schraubenneigung\")","v":"Screw inclination"},"α",60,"°","30° ≤ α ≤ 60°"]
[null,"Schraubenneigung","α 1",60,null,"30° ≤ α1 ≤ 90° lt. Zulassung"]
[null,null,"α 2",60,null,"30° ≤ α2 ≤ 90° lt. Zulassung"]
[]
[null,{"$f":"ml(\"lst_sp_tit\",\"Kopfposition\")","v":"Head position"},"Head not countersunk"]
[null,null,"t f",0,"mm"]
[{"$f":"ml(\"ad_schrau_abm\",\"Schraubenabmessungen\")","v":"Screw dimensions"},null,null,null,null,null,null,null,null,null,null,null,null,{"$f":"ml(\"ad_schrau_abm\",\"Schraubenabmessungen\")","v":"Screw dimensions"}]
[null,{"$f":"ml(\"tcf_gesl\",\"Gesamtlänge\")","v":"Total length"},"L",{"$f":"L_Sch","v":450},"mm",null,null,null,null,null,null,null,null,null,{"$f":"ml(\"tcf_gesl\",\"Gesamtlänge\")","v":"Total length"},"L",{"$f":"L_Sch_2","v":400},"mm"]
[null,{"$f":"ml(\"ad_nenndu\",\"Nenndurchmesser\")","v":"Nominal diameter"},"d ",{"$f":"d_schraube","v":8},"mm",null,null,null,null,null,null,null,null,null,{"$f":"ml(\"ad_nenndu\",\"Nenndurchmesser\")","v":"Nominal diameter"},"d ",{"$f":"d_schraube_2","v":8},"mm"]
[null,{"$f":"ml(\"ad_auszie\",\"Ausziehparameter\")","v":"Extensible parameter"},"f 1,k",{"$f":"Listen!$H$44","v":13.1},"N/mm²",null,null,null,null,null,null,null,null,null,{"$f":"ml(\"ad_auszie\",\"Ausziehparameter\")","v":"Extensible parameter"},"f 1,k",{"$f":"Listen!$H$45","v":13.1},"N/mm²"]
[null,{"$f":"ml(\"ad_kopfdu\",\"Kopfdurchmesser\")","v":"Screwhead diameter"},"d k",{"$f":"dk_schraube","v":10.199999999999999},"mm",null,null,null,null,null,null,null,null,null,{"$f":"ml(\"ad_kopfdu\",\"Kopfdurchmesser\")","v":"Screwhead diameter"},"d k",{"$f":"dk_schraube_2","v":10.199999999999999},"mm"]
[null,{"$f":"ml(\"ad_kopfdu_\",\"Kopfdurchziehparameter\")","v":"Screwhead pull-through parameter"},"f head,k",{"$f":"Listen!$G$44","v":0},"N/mm²",null,null,null,null,null,null,null,null,null,{"$f":"ml(\"ad_kopfdu_\",\"Kopfdurchziehparameter\")","v":"Screwhead pull-through parameter"},"f head,k",{"$f":"Listen!$G$45","v":0},"N/mm²"]
[{"$f":"ml(\"ad_längen\",\"Längen in der Konstruktion mit harter Dämmung\")","v":"Lenght in the construction with hard insulation"}]
[null,{"$f":"ml(\"ad_länge \",\"Länge in Konterlatte\")","v":"Length in counter-batten"},"ℓ ef,L",{"$f":"G117","v":34.641016151377549},"mm"]
[null,{"$f":"ml(\"ad_gewind\",\"Gewinde in Latte\")","v":"Screw thread in lath"},"ℓ gew,L",{"$f":"MAX(0,MIN(G117,G117-$G$125-tf))","v":{"$error":"#NAME?"}},"mm"]
[null,{"$f":"ml(\"ad_länge2\",\"Länge in Dämmung\")","v":"Lenght in insulation"},"ℓ D",{"$f":"G118","v":311.76914536239792},"mm"]
[null,{"$f":"ml(\"ad_länge3\",\"Länge in Unterkonstr.\")","v":"Length in subconstruction"},"ℓ ef,UK",{"$f":"G119+tf","v":103.58983848622455},"mm"]
[null,{"$f":"ml(\"ad_gewind2\",\"Gewinde in UK\")","v":"Screw thread in subconstruction"},"ℓ gew,UK",{"$f":"MIN(G124,D108)","v":{"$error":"#NAME?"}},"mm"]
[]
[{"$f":"ml(\"ad_überp\",\"Überprüfung der Geometrie\") &\" (α =\"&TEXT(alpha,\"0\")&\" ± \"&TEXT(F115,\"0\")&\"°)\"","v":"Check of the geometry (α =60 ± 5°)"},null,null,{"$f":"IF($K$121,\"ü\",\"û\")","v":"ü"}]
[null,{"$f":"IF(K121,\nml(\"ad_wenn1\",\"Die Schrauben haben die richtige Länge.\"),\n_xlfn.TEXTJOIN(\" \",TRUE,L119,L120,P119,P120))","v":{"$error":"#NAME?"}}]
[null,""]
[{"$f":"ml(\"ad_konstr_mind\",\"Konstruktiver Mindestabstand der Windsogsichernden Schrauben\")","v":"Minimum constructive distance between screws against wind suction "}]
[null,"Geometrie für Druckfeste Dämmung",null,null,{"$f":"alpha","v":60},5]
[null,null,null,null,{"$f":"E115-F115","v":55},null,{"$f":"E115","v":60},{"$f":"E115+F115","v":65},null,null,"erfüllt",null,90]
[null,"Länge in Konterlatte",null,"ℓ ef,L",{"$f":"(h_kl*10)/(SIN(E116*PI()/180))","v":36.623237662843678},"mm",{"$f":"(h_kl*10)/(SIN(G116*PI()/180))","v":34.641016151377549},{"$f":"(h_kl*10)/(SIN(H116*PI()/180))","v":33.101337568874754},"mm",null,null,null,{"$f":"(h_kl*10)/(SIN(M116*PI()/180))","v":30}]
[null,"Länge in Dämmung",null,"ℓ D",{"$f":"(vba_dDAE)/SIN(E116*PI()/180)","v":329.60913896559316},"mm",{"$f":"(vba_dDAE)/SIN(G116*PI()/180)","v":311.76914536239792},{"$f":"(vba_dDAE)/SIN(H116*PI()/180)","v":297.91203811987276},"mm",null,null,null,{"$f":"(vba_dDAE)/SIN(M116*PI()/180)","v":270}]
[null,"Länge in Unterkonstr.",null,"ℓ ef,UK",{"$f":"MAX(vba_Schraube_L-E117-E118,0)","v":83.767623371563161},"mm",{"$f":"MAX(vba_Schraube_L-G117-G118,0)","v":103.58983848622455},{"$f":"MAX(vba_Schraube_L-H117-H118,0)","v":118.98662431125246},"mm","≥! ℓ min,UK",{"$f":"MIN(E119:H119)>=$G$122","v":true},{"$f":"IF(NOT(K119),\n   ml(\"ad_tooshort1\",\"Die Schrauben zur Dachschubsicherung sind um {0} mm zu kurz!\",ROUND(E120,0)),\n   \"\")","v":""},{"$f":"MAX(vba_Schraube_L_2-M117-M118,0)","v":100},"≥! ℓ min,UK",{"$f":"M119>=$G$122","v":true},{"$f":"IF(NOT(O119),ml(\"ad_tooshort2\",\"Die Schrauben zur Windsogsicherung sind um {0} mm zu kurz!\",ROUND(G122-M119,0)),\"\")","v":""}]
[null,"Fehllänge",null,null,{"$f":"G122-(vba_Schraube_L-E117-E118)","v":-35.767623371563161},null,{"$f":"G122-(vba_Schraube_L-G117-G118)","v":-55.589838486224551},{"$f":"G122-(vba_Schraube_L-H117-H118)","v":-70.986624311252456},null,"≤! ℓ max,UK",{"$f":"MAX(E119:H119)<=$G$123","v":true},{"$f":"IF(NOT(K120),ml(\"ad_toolong1\",\"Die Schrauben zur Dachschubsicherung sind zu lange!\"),\"\")","v":""},null,"≤! h_sparren",{"$f":"M119<=h_sparren*10","v":true},{"$f":"IF(NOT(O120),ml(\"ad_toolong2\",\"Die Schrauben zur Windsogsicherung sind zu lang\"),\"\")","v":""}]
[null,null,null,null,null,null,null,null,null,null,{"$f":"AND(K119:K120,O119:O120)","v":true}]
[null,"Mindestlänge in UK",null,"ℓ min,UK",null,null,{"$f":"MAX(0,6*vba_Schraube_d)","v":48},"mm"]
[null,"Maximallänge in UK",null,"ℓ max,UK",null,null,{"$f":"h_sparren/SIN(G116*PI()/180)*10","v":230.94010767585033},"mm"]
[null,"Gewindelänge",null,null,null,null,{"$f":"l_gewinde","v":{"$error":"#NAME?"}},"mm"]
[null,"Gewindeanfang",null,null,null,null,{"$f":"L_Sch-l_gewinde","v":{"$error":"#NAME?"}},"mm"]
[null,"l eff, UK",null,null,null,null,{"$f":"MIN(G124,G119)","v":{"$error":"#NAME?"}},"mm",null,null,null,null,"Gewindelänge in UK"]
[{"$f":"ml(\"ad_length\",\"Längen von Schraube {0} in der Konstruktion mit weicher Dämmung\",\"1\")","v":"Lengths of screw 1 in the construction with soft insulation"}]
[null,{"$f":"ml(\"ad_länge \",\"Länge in Konterlatte\")","v":"Length in counter-batten"},"ℓ ef,L",{"$f":"F148","v":34.641016151377549},"mm"]
[null,{"$f":"ml(\"ad_gewind\",\"Gewinde in Latte\")","v":"Screw thread in lath"},"ℓ gew,L",{"$f":"F149","v":{"$error":"#NAME?"}},"mm"]
[null,{"$f":"ml(\"ad_länge2\",\"Länge in Dämmung\")","v":"Lenght in insulation"},"ℓ D",{"$f":"F150","v":311.76914536239792},"mm"]
[null,{"$f":"ml(\"ad_länge3\",\"Länge in Unterkonstr.\")","v":"Length in subconstruction"},"ℓ ef,UK",{"$f":"F151","v":103.58983848622455},"mm"]
[null,{"$f":"ml(\"ad_gewind2\",\"Gewinde in UK\")","v":"Screw thread in subconstruction"},"ℓ gew,UK",{"$f":"MIN(D131,F155)","v":{"$error":"#NAME?"}},"mm"]
[]
[{"$f":"ml(\"ad_length\",\"Längen von Schraube {0} in der Konstruktion mit weicher Dämmung\",\"2\")","v":"Lengths of screw 2 in the construction with soft insulation"}]
[null,{"$f":"ml(\"ad_länge \",\"Länge in Konterlatte\")","v":"Length in counter-batten"},"ℓ ef,L",{"$f":"M148","v":34.641016151377549},"mm"]
[null,{"$f":"ml(\"ad_gewind\",\"Gewinde in Latte\")","v":"Screw thread in lath"},"ℓ gew.,L",{"$f":"M149","v":{"$error":"#NAME?"}},"mm"]
[null,{"$f":"ml(\"ad_länge2\",\"Länge in Dämmung\")","v":"Lenght in insulation"},"ℓ D",{"$f":"M150","v":311.76914536239792},"mm"]
[null,{"$f":"ml(\"ad_länge3\",\"Länge in Unterkonstr.\")","v":"Length in subconstruction"},"ℓ ef,UK",{"$f":"M151","v":103.58983848622455},"mm"]
[null,{"$f":"ml(\"ad_gewind2\",\"Gewinde in UK\")","v":"Screw thread in subconstruction"},"ℓ gew,UK",{"$f":"MIN(D138,F155)","v":{"$error":"#NAME?"}},"mm"]
[]
[{"$f":"ml(\"ad_überp\",\"Überprüfung der Geometrie\") & \" (α1 =\"&TEXT(alpha_1_weich,\"0\")&\" ± \"&TEXT(M146,\"0\")&\"°; α2 =\"&TEXT(alpha_2_weich,\"0\")&\" ± \"&TEXT(F146,\"0\")&\"°)\"","v":"Check of the geometry (α1 =60 ± 5°; α2 =60 ± 5°)"},null,null,{"$f":"IF(IF(index_variante=1,$K$121,$J$153),\"ü\",\"û\")","v":"ü"}]
[null,{"$f":"IF(J153,\nml(\"ad_scorlen\",\"Schraube {0} hat die richtige Länge.\",\"1\"),\nIF(J149,\"\",ml(\"250425_a\",\"Die Gewindelänge von Schraube {0} in der Konterlatte ist zu gering\",\"1\") &\" (\" & TEXT(MIN(E149:G149),\"0\") & \" < \" & TEXT(F153,\"0\") & \" mm)! \") &\nIF(AND(J151:J152),\"\",IF(J151,\"\",ml(\"250425_b\",\"Schraube {0} ist um {1} mm zu kurz!\",\"1\",TEXT(MAX(0,-(vba_Schraube_L-E148-E150)+F153),\"0\")))&\nIF(J152,\"\",ml(\"250425_c\",\"Schraube {0} ist um {1} mm zu lang!\",\"2\", TEXT(MAX(E151:G151)-F157,\"0\")))))","v":{"$error":"#NAME?"}}]
[null,{"$f":"IF(J153,\nml(\"ad_scorlen\",\"Schraube {0} hat die richtige Länge.\",\"2\"),\nIF(P149,\"\",ml(\"250425_a\",\"Die Gewindelänge von Schraube {0} in der Konterlatte ist zu gering\",\"2\")&\" (\" & TEXT(MIN(L149:N149),\"0\") & \" < \" & TEXT(F153,\"0\") & \" mm)! \") &\nIF(AND(P151:P152),\"\",IF(P151,\"\",ml(\"250425_b\",\"Schraube {0} ist um {1} mm zu kurz!\",\"2\",TEXT(MAX(0,-(vba_Schraube_L-L148-L150)+F153),\"0\")))&\nIF(P152,\"\",ml(\"250425_c\",\"Schraube {0} ist um {1} mm zu lang!\",\"2\", TEXT(MAX(L151:N151)-F157,\"0\")))))","v":{"$error":"#NAME?"}}]
[]
[null,"Geometrie für weiche Dämmung",null,null,"alpha 1",null,null,null,null,null,null,"alpha 2"]
[null,null,null,null,{"$f":"alpha_1_weich","v":60},5,null,null,null,null,null,{"$f":"alpha_2_weich","v":60},5]
[null,null,null,null,{"$f":"E146-F146","v":55},{"$f":"E146","v":60},{"$f":"E146+F146","v":65},null,null,"erfüllt",null,{"$f":"L146-M146","v":55},{"$f":"L146","v":60},{"$f":"L146+M146","v":65}]
[null,"Länge in Konterlatte",null,"ℓ ef,L",{"$f":"(h_kl*10)/(SIN(E147*PI()/180))","v":36.623237662843678},{"$f":"(h_kl*10)/(SIN(F147*PI()/180))","v":34.641016151377549},{"$f":"(h_kl*10)/(SIN(G147*PI()/180))","v":33.101337568874754},"mm",null,null,null,{"$f":"(h_kl*10)/(SIN(L147*PI()/180))","v":36.623237662843678},{"$f":"(h_kl*10)/(SIN(M147*PI()/180))","v":34.641016151377549},{"$f":"(h_kl*10)/(SIN(N147*PI()/180))","v":33.101337568874754}]
[null,"Gewinde in K.Latte",null,"ℓ gew.,L",{"$f":"MAX(0,E148-$F156-tf)","v":{"$error":"#NAME?"}},{"$f":"MAX(0,MIN(F148,F148-$F156-tf))","v":{"$error":"#NAME?"}},{"$f":"MAX(0,G148-$F156-tf)","v":{"$error":"#NAME?"}},"mm","≥! ℓ min,KL",{"$f":"MIN(E149:G149)>=$F158","v":{"$error":"#NAME?"}},null,{"$f":"MAX(0,L148-$F156-tf)","v":{"$error":"#NAME?"}},{"$f":"MAX(0,M148-$F156-tf)","v":{"$error":"#NAME?"}},{"$f":"MAX(0,N148-$F156-tf)","v":{"$error":"#NAME?"}},"≥! ℓ min,KL",{"$f":"MIN(L149:N149)>=$F158","v":{"$error":"#NAME?"}}]
[null,"Länge in Dämmung",null,"ℓ D",{"$f":"(vba_dDAE)/SIN(E147*PI()/180)","v":329.60913896559316},{"$f":"(vba_dDAE)/SIN(F147*PI()/180)","v":311.76914536239792},{"$f":"(vba_dDAE)/SIN(G147*PI()/180)","v":297.91203811987276},"mm",null,null,null,{"$f":"(vba_dDAE)/SIN(L147*PI()/180)","v":329.60913896559316},{"$f":"(vba_dDAE)/SIN(M147*PI()/180)","v":311.76914536239792},{"$f":"(vba_dDAE)/SIN(N147*PI()/180)","v":297.91203811987276}]
[null,"Länge in Unterkonstr.",null,"ℓ ef,UK",{"$f":"MAX(vba_Schraube_L-E148-E150+tf,0)","v":83.767623371563161},{"$f":"MAX(vba_Schraube_L-F148-F150+tf,0)","v":103.58983848622455},{"$f":"MAX(vba_Schraube_L-G148-G150+tf,0)","v":118.98662431125246},"mm","≥! ℓ min,UK",{"$f":"MIN(E151:G151)>=F153","v":true},null,{"$f":"MAX(vba_Schraube_L-L148-L150+tf,0)","v":83.767623371563161},{"$f":"MAX(vba_Schraube_L-M148-M150+tf,0)","v":103.58983848622455},{"$f":"MAX(vba_Schraube_L-N148-N150+tf,0)","v":118.98662431125246},"≥! ℓ min,UK",{"$f":"MIN(L151:N151)>=F153","v":true}]
[null,null,null,null,null,null,null,null,"≤! ℓ max,UK",{"$f":"MAX(E151:G151)<=F154","v":true},null,null,null,null,"≤! ℓ max,UK",{"$f":"MAX(L151:N151)<=F154","v":true}]
[null,"Mindestlänge in UK",null,"ℓ min,UK",null,{"$f":"MAX(60,4*vba_Schraube_d)","v":60},"mm",null,null,{"$f":"AND(J149,J151:J152,P149,P151:P152)","v":{"$error":"#NAME?"}}]
[null,"Maximallänge in UK",null,"ℓ max,UK",null,{"$f":"h_sparren/SIN(F147*PI()/180)*10","v":230.94010767585033},"mm"]
[null,"Gewindelänge",null,null,null,{"$f":"l_gewinde","v":{"$error":"#NAME?"}},"mm"]
[null,"Gewindeanfang",null,null,null,{"$f":"L_Sch-l_gewinde","v":{"$error":"#NAME?"}},"mm"]
[null,"l eff, UK",null,null,null,{"$f":"MIN(F155,F151)","v":{"$error":"#NAME?"}},"mm"]
[null,"Mindesteinschraublänge",null,"ℓ min,KL",null,{"$f":"4*vba_Schraube_d","v":32},"mm"]
[null,null,"e max",150,"cm"]
[{"$f":"ml(\"ad_zusamm\",\"ZUSAMMENFASSUNG:\")","v":"SUMMARY:"}]
[null,{"$f":"CHOOSE(vba_TypeIndex,'summary hard'!D74,'summary soft'!D44)","v":{"$error":"#NAME?"}},{"$f":"ml(\"ad_stk\",\"Stk. Schrauben insgesamt\")","v":"Number of screws"}]
[]
[null,{"$f":"CHOOSE(vba_TypeIndex,MAX('calculation hard'!B56),MAX('calculation soft'!B48,'calculation soft'!B56,'calculation soft'!B62,'calculation soft'!B66))","v":{"$error":"#NAME?"}},{"$f":"ml(\"ad_schraube_tragf\",\"Schraubentragfähigkeit \")","v":"Screw load bearing capacity"}]
[null,{"$f":"CHOOSE(vba_TypeIndex,'calculation hard'!B91,'calculation soft'!B91)","v":1.0119012827349514},{"$f":"ml(\"ad_bieget_konter\",\"Biegetragfähigkeit Konterlatte\")","v":"Bending resistance restraning lath"}]
[null,{"$f":"CHOOSE(vba_TypeIndex,'calculation hard'!B96,\"-\")","v":8.0509267701147816E-2},{"$f":"ml(\"ad_pressu\",\"Pressung der Dämmung\")","v":"Compression of the insulation"}]
[]
[{"$f":"ml(\"ad_bedingt_text\",\"Bedingt durch konstruktive Gegebenheiten wie z.B. die Länge der Konterlatten, Lattenstöße, Gauben, Kehlen etc. kann sich die Anzahl der Schrauben um 10% bis 20% gegenüber dem angegebenen Wert erhöhen.\")","v":"Due to structural conditions such as the length of the counter-batten, joints, dormers, grooves etc., the number of screws can increase by 10% to 20% compared to the specified value."}]

{"sheet":"summary soft","index":4,"n_rows":62,"n_cols":8,"rows_kept":62,"cut":false,"hidden":true,"merged":[[3,1,3,7],[4,1,4,7],[14,3,15,7],[44,0,44,6]]}
[{"$f":"ml(\"ad_aufdachdaemmung_zusammenfassung\",\"Aufdachdämmsystem - Zusammenfassung\")","v":"Thermal Insulation - Summary"}]
[{"$f":"ml(\"ad_zusamm_weich\",\"Zusammenfassung für Systeme mit weicher Dämmung\")","v":"Summary for constructions with soft insulation"}]
[null,null,null,null,null,null,null,{"$f":"Version","v":"V 26.03.01"}]
[{"$f":"ml(\"ad_bauvorhaben\",\"Bauvorhaben\")","v":"Project"},{"$f":"IF('Thermal insulation'!B3=\"\",\"\",'Thermal insulation'!B3)","v":""}]
[{"$f":"ml(\"tc_pos.nr\",\"Pos.Nr.:\")","v":"Pos. No.:"},{"$f":"IF('Thermal insulation'!B4=\"\",\"\",'Thermal insulation'!B4)","v":""}]
[]
[{"$f":"IF(beta=90,ml(\"ad_dachge2\",\"Geometrie\",ml(\"ad_dachge\",\"Dachgeometrie\")))","v":"Dimensions"}]
[{"$f":"'Thermal insulation'!B52","v":"Shape"},null,null,{"$f":"'Thermal insulation'!D52","v":"single pitched / flat"}]
[{"$f":"'Thermal insulation'!B56","v":"Wall height"},null,"b 1",{"$f":"'Thermal insulation'!D56","v":9.8000000000000007},"m"]
[{"$f":"'Thermal insulation'!B57","v":"Wall length"},null,"b 2",{"$f":"'Thermal insulation'!D57","v":12},"m"]
[{"$f":"Location!B14","v":"Battens spacing"},null,"b e",{"$f":"b_e","v":0.6},"m"]
[{"$f":"'Thermal insulation'!B53","v":"Wall"},null,"β",{"$f":"beta","v":90},"°"]
[{"$f":"'Thermal insulation'!B58","v":"Wall area"},null,null,{"$f":"D9*D10","v":117.60000000000001},"m2"]
[]
[{"$f":"ml(\"ad_befestigunsvariante\",\"Befestigungsvariante\")","v":"Fixing method"},null,null,{"$f":"vba_daemmungTyp","v":"Method 2 - Hard Insulation / one direction of inclination of the screws"}]
[]
[{"$f":"ml(\"ad_belastung\",\"Belastung\")","v":"Load"}]
[{"$f":"ml(\"tc_eigeng1_\",\"Eigengewicht\")","v":"Dead load"},null,"g 1,k",{"$f":"gk","v":0.3},"kN/m²"]
[{"$f":"ml(\"tc_nutzla3__\",\"Nutzlast\")","v":"Live load"},null,"q k",{"$f":"nk","v":1},"kN/m²"]
[null,null,"Q k",{"$f":"Q_k","v":1.5},"kN"]
[{"$f":"ml(\"ad_schneelast\",\"Schneelast\")","v":"Snow load"},null,"s k",{"$f":"sk","v":1.6},"kN/m²"]
[{"$f":"ml(\"ad_winddruck\",\"Winddruck\")","v":"Wind pressure"},null,"w D,k",{"$f":"wdk","v":0.9840021607918068},"kN/m²"]
[{"$f":"ml(\"ad_windsog\",\"Windsog\")","v":"Wind suction"},null,"w S,k",{"$f":"wsk","v":-1.9680043215836136},"kN/m²"]
[]
[{"$f":"ml(\"ad_dämmst\",\"Dämmstoff\")","v":"Insulation"}]
[{"$f":"ml(\"ad_produk\",\"Produkt\")","v":"Product"},null,null,{"$f":"vba_daemmstoff","v":"Soft wood fibre insulation"}]
[{"$f":"ml(\"ad_dicke\",\"Dicke\")","v":"Thickness"},null,null,{"$f":"'Thermal insulation'!D72","v":250},"mm"]
[]
[{"$f":"ml(\"ad_verbindmittel\",\"Verbindungsmittel\")","v":"Connection"}]
[]
[{"$f":"ml(\"ad_dachsc_windsog\",\"Schubsicherung und Windsogsicherung\")","v":"Shear and wind suction securing"}]
[{"$f":"ml(\"ad_schrau2\",\"Schraubentyp\")","v":"Screw type"},null,null,{"$f":"'Thermal insulation'!B86","v":"ESSVE CY-FT  8,0 x 450/427"}]
[{"$f":"ml(\"ad_schraudim\",\"Schraubendimension\")","v":"Screw dimension"},null,null,{"$f":"TEXT(vba_Schraube_d,\"0,0\")&\" x \" &TEXT(vba_Schraube_L,\"0\")","v":"8,0 x 450"},"mm"]
[{"$f":"ml(\"ad_schrau_n\",\"Schraubenneigung\")","v":"Screw inclination"},null,"α1",{"$f":"alpha_1_weich","v":60},"°"]
[null,null,"α2",{"$f":"alpha_2_weich","v":60},"°"]
[{"$f":"ml(\"ad_schrau\",\"Schraubenabstand\")","v":"Screw distance"},null,"A",{"$f":"abstand_a","v":175},"cm"]
[null,null,"B",{"$f":"abstand_b","v":5},"cm"]
[]
[{"$f":"ml(\"ad_anzahl1\",\"Anzahl der Sparrenachsen\")","v":"No. of member axis"},null,null,{"$f":"ROUNDUP(D10/D11,0)","v":20},{"$f":"ml(\"ad_pcs\",\"STK\")","v":"pcs."}]
[{"$f":"ml(\"ad_anzahl2\",\"Anzahl der Schrauben je Sparrenachse\")","v":"Screws per member"},null,null,{"$f":"ROUNDUP(D9*100/D36*2,0)","v":12},{"$f":"IF(beta=90,ml(\"ad_pcsRafter_2\",\"STK/Traglatten\"),ml(\"ad_pcsRafter\",\"STK/Sparren\"))","v":"pcs/batten"}]
[{"$f":"ml(\"ad_anzahl3\",\"Anzahl der Schrauben je lfm Sparrenachse\")","v":"Screws per meter member"},null,null,{"$f":"D40/D9","v":1.2244897959183672},{"$f":"ml(\"ad_pcspm\",\"STK/m\")","v":"pcs./m"}]
[{"$f":"ml(\"ad_anzahl4\",\"Anzahl der Schrauben je m2 Dachfläche\")","v":"Screws per square meter"},null,null,{"$f":"D41/D11","v":2.0408163265306118},{"$f":"ml(\"ad_pcspsm\",\"STK/m²\")","v":"pcs./m²"}]
[]
[{"$f":"ml(\"ad_schrau3\",\"Schrauben - Gesamtstückzahl\")","v":"Total number of screws"},null,null,{"$f":"ROUNDUP(D39*D40,0)","v":240},{"$f":"ml(\"ad_pcs\",\"STK\")","v":"pcs."}]
[{"$f":"ml(\"ad_bedingt_text\",\"Bedingt durch konstruktive Gegebenheiten wie z.B. die Länge der Konterlatten, Lattenstöße, Gauben, Kehlen etc. kann sich die Anzahl der Schrauben um 10% bis 20% gegenüber dem angegebenen Wert erhöhen.\")","v":"Due to structural conditions such as the length of the counter-batten, joints, dormers, grooves etc., the number of screws can increase by 10% to 20% compared to the specified value."}]
[]
[{"$f":"ml(\"ad_nachwe\",\"Nachweise und Auslastungen\")","v":"Design and utilization"}]
[{"$f":"ml(\"ad_schraube1\",\"Schraube 1\")","v":"Screw 1"},null,null,{"$f":"MAX('calculation soft'!B48,'calculation soft'!B62)","v":{"$error":"#NAME?"}}]
[{"$f":"ml(\"ad_schraube2\",\"Schraube 2\")","v":"Screw 2"},null,null,{"$f":"MAX('calculation soft'!B56,'calculation soft'!B66)","v":{"$error":"#NAME?"}}]
[{"$f":"ml(\"ad_konter_grundl\",\"Konterlatte / Grundlatte\")","v":"Counter-batten"},null,null,{"$f":"'calculation soft'!B91","v":0.14176260764956569}]
[]
[]
[]
[]
[]
[]
[]
[]
[]
[]
[]
["Dachschub",{"$f":"TEXT(D42,\"0,00\")&\" \"&TEXT(E42,\"0\")&\"   \"&\" e= \"&TEXT(D36,\"0,00\")&\" cm\" & IF(beta=90,ml(\"ad_entlangF\",\"entlang der Traglatten\"),ml(\"ad_entlang\",\"entlang der Sparren\"))","v":"2,04 pcs./m²    e= 175,00 cm along the battens"}]

{"sheet":"summary hard","index":5,"n_rows":87,"n_cols":8,"rows_kept":87,"cut":false,"hidden":false,"merged":[[13,3,14,7],[2,2,2,7],[3,2,3,7],[74,0,74,6]]}
[{"$f":"ml(\"ad_aufdachdaemmung_zusammenfassung\",\"Aufdachdämmsystem - Zusammenfassung\")","v":"Thermal Insulation - Summary"}]
[null,null,null,null,null,null,null,{"$f":"Version","v":"V 26.03.01"}]
[{"$f":"ml(\"ad_bauvorhaben\",\"Bauvorhaben\")","v":"Project"},null,{"$f":"IF('Thermal insulation'!B3=\"\",\"\",'Thermal insulation'!B3)","v":""}]
[{"$f":"ml(\"tc_pos.nr\",\"Pos.Nr.:\")","v":"Pos. No.:"},null,{"$f":"IF('Thermal insulation'!B4=\"\",\"\",'Thermal insulation'!B4)","v":""}]
[]
[{"$f":"IF(beta=90,ml(\"ad_dachge2\",\"Geometrie\",ml(\"ad_dachge\",\"Dachgeometrie\")))","v":"Dimensions"}]
[{"$f":"'Thermal insulation'!B52","v":"Shape"},null,null,{"$f":"'Thermal insulation'!D52","v":"single pitched / flat"}]
[{"$f":"'Thermal insulation'!B56","v":"Wall height"},null,"b 1",{"$f":"'Thermal insulation'!D56","v":9.8000000000000007},"m"]
[{"$f":"'Thermal insulation'!B57","v":"Wall length"},null,"b 2",{"$f":"'Thermal insulation'!D57","v":12},"m"]
[{"$f":"Location!B14","v":"Battens spacing"},null,"b e",{"$f":"b_e","v":0.6},"m"]
[{"$f":"'Thermal insulation'!B53","v":"Wall"},null,"β",{"$f":"beta","v":90},"°"]
[{"$f":"'Thermal insulation'!B58","v":"Wall area"},null,null,{"$f":"D8*D9","v":117.60000000000001},"m2"]
[]
[{"$f":"ml(\"ad_befestigunsvariante\",\"Befestigungsvariante\")","v":"Fixing method"},null,null,{"$f":"vba_daemmungTyp","v":"Method 2 - Hard Insulation / one direction of inclination of the screws"}]
[]
[{"$f":"ml(\"ad_belastung\",\"Belastung\")","v":"Load"}]
[{"$f":"ml(\"tc_eigeng1_\",\"Eigengewicht\")","v":"Dead load"},null,"g 1,k",{"$f":"gk","v":0.3},"kN/m²"]
[{"$f":"ml(\"tc_nutzla3__\",\"Nutzlast\")","v":"Live load"},null,"q k",{"$f":"nk","v":1},"kN/m²"]
[null,null,"Q k",{"$f":"Q_k","v":1.5},"kN"]
[{"$f":"ml(\"ad_schneelast\",\"Schneelast\")","v":"Snow load"},null,"s k",{"$f":"sk","v":1.6},"kN/m²"]
[{"$f":"ml(\"ad_winddruck\",\"Winddruck\")","v":"Wind pressure"},null,"w D,k",{"$f":"wdk","v":0.9840021607918068},"kN/m²"]
[{"$f":"ml(\"ad_windsog\",\"Windsog\")","v":"Wind suction"},null,"w S,k",{"$f":"wsk","v":-1.9680043215836136},"kN/m²"]
[]
[{"$f":"ml(\"ad_dämmst\",\"Dämmstoff\")","v":"Insulation"}]
[{"$f":"ml(\"ad_produk\",\"Produkt\")","v":"Product"},null,null,{"$f":"vba_daemmstoff","v":"Soft wood fibre insulation"}]
[{"$f":"ml(\"ad_dicke\",\"Dicke\")","v":"Thickness"},null,null,{"$f":"'Thermal insulation'!D72","v":250},"mm"]
[]
[{"$f":"ml(\"ad_verbindmittel\",\"Verbindungsmittel\")","v":"Connection"}]
[]
[{"$f":"ml(\"ad_dachsc\",\"Dachschubsicherung\")","v":"Shear securing"}]
[{"$f":"ml(\"ad_schrau2\",\"Schraubentyp\")","v":"Screw type"},null,null,{"$f":"vba_Screw","v":"ESSVE CY-FT  8,0 x 450/427"}]
[{"$f":"ml(\"ad_schraudim\",\"Schraubendimension\")","v":"Screw dimension"},null,null,{"$f":"TEXT(vba_Schraube_d,\"0,0\")&\" x \" &TEXT(vba_Schraube_L,\"0\")","v":"8,0 x 450"},"mm"]
[{"$f":"ml(\"ad_schrau_n\",\"Schraubenneigung\")","v":"Screw inclination"},null,"α",{"$f":"alpha","v":60},"°"]
[{"$f":"ml(\"ad_schrau\",\"Schraubenabstand\")","v":"Screw distance"},null,"A",{"$f":"abstand_a","v":175},"cm"]
[]
[{"$f":"ml(\"ad_anzahl1\",\"Anzahl der Sparrenachsen\")","v":"No. of member axis"},null,null,{"$f":"ROUNDUP(D9/D10,0)","v":20},{"$f":"ml(\"ad_pcs\",\"STK\")","v":"pcs."}]
[{"$f":"ml(\"ad_anzahl2\",\"Anzahl der Schrauben je Sparrenachse\")","v":"Screws per member"},null,null,{"$f":"ROUNDUP(D8*100/D34,0)","v":6},{"$f":"IF(beta=90,ml(\"ad_pcsRafter_2\",\"STK/Traglatten\"),ml(\"ad_pcsRafter\",\"STK/Sparren\"))","v":"pcs/batten"}]
[{"$f":"ml(\"ad_anzahl3\",\"Anzahl der Schrauben je lfm Sparrenachse\")","v":"Screws per meter member"},null,null,{"$f":"D37/D8","v":0.61224489795918358},{"$f":"ml(\"ad_pcspm\",\"STK/m\")","v":"pcs./m"}]
[{"$f":"ml(\"ad_anzahl4\",\"Anzahl der Schrauben je m2 Dachfläche\")","v":"Screws per square meter"},null,null,{"$f":"D38/D10","v":1.0204081632653059},{"$f":"ml(\"ad_pcspsm\",\"STK/m²\")","v":"pcs./m²"}]
[]
[{"$f":"ml(\"ad_schrau4\",\"Schraubenstückzahl\")","v":"Nubmer of screws"},null,null,{"$f":"ROUNDUP(D36*D37,0)","v":120},{"$f":"ml(\"ad_pcs\",\"STK\")","v":"pcs."}]
[]
[{"$f":"ml(\"ad_windso\",\"Windsogsicherung\")","v":"Wind suction securing"}]
[{"$f":"ml(\"ad_schrau2\",\"Schraubentyp\")","v":"Screw type"},null,null,{"$f":"vba_Screw_2","v":"Essve C-PT  8,0 x 300/100"}]
[{"$f":"ml(\"ad_schraudim\",\"Schraubendimension\")","v":"Screw dimension"},null,null,{"$f":"TEXT(vba_Schraube_d_2,\"0,0\")&\" x \" &TEXT(vba_Schraube_L_2,\"0\")","v":"8,0 x 400"},"mm"]
[{"$f":"ml(\"ad_schrau_n\",\"Schraubenneigung\")","v":"Screw inclination"},null,null,{"$f":"alpha_1","v":90},"°"]
[]
[{"$f":"ml(\"ad_bereic1\",\"Bereich H,I\")","v":"Area H, I"}]
[{"$f":"ml(\"ad_schraubenabstand1\",\"Schraubenabstand Bereich H, I\")","v":"Screw distance area H, I"},null,null,{"$f":"e_sog_h","v":{"$error":"#NAME?"}},"cm",{"$f":"IF(e_max<D49,\"→ e max = \" & e_max & \" cm\",\"\")","v":{"$error":"#NAME?"}}]
[{"$f":"ml(\"ad_anzahl5\",\"Schrauben je lfm Sparren\")","v":"Screws per meter "},null,null,{"$f":"1/(MIN(MIN(e_max,D49)/100))","v":{"$error":"#NAME?"}},{"$f":"ml(\"ad_pcspm\",\"STK/m\")","v":"pcs./m"}]
[{"$f":"ml(\"ad_anzahl4.1\",\"Schrauben je m2 Dachfläche\")","v":"Screws per sqm [m²]"},null,null,{"$f":"D50/$D$10","v":{"$error":"#NAME?"}},{"$f":"ml(\"ad_pcspsm\",\"STK/m²\")","v":"pcs./m²"}]
[{"$f":"ml(\"ad_schrau4\",\"Schraubenstückzahl\")","v":"Nubmer of screws"},null,null,{"$f":"D51*Fläche_H","v":{"$error":"#NAME?"}},{"$f":"ml(\"ad_pcs\",\"STK\")","v":"pcs."}]
[]
[{"$f":"ml(\"ad_bereic2\",\"Bereich G\")","v":"Area G"}]
[{"$f":"ml(\"ad_schraubenabstand2\",\"Schraubenabstand Bereich G\")","v":"Screw distance area G"},null,null,{"$f":"e_sog_g","v":{"$error":"#NAME?"}},"cm",{"$f":"IF(e_max<D55,\"→ e max = \" & e_max & \" cm\",\"\")","v":{"$error":"#NAME?"}}]
[{"$f":"ml(\"ad_anzahl5\",\"Schrauben je lfm Sparren\")","v":"Screws per meter "},null,null,{"$f":"1/(MIN(e_max,D55)/100)","v":{"$error":"#NAME?"}},{"$f":"ml(\"ad_pcspm\",\"STK/m\")","v":"pcs./m"}]
[{"$f":"ml(\"ad_anzahl4.1\",\"Schrauben je m2 Dachfläche\")","v":"Screws per sqm [m²]"},null,null,{"$f":"D56/$D$10","v":{"$error":"#NAME?"}},{"$f":"ml(\"ad_pcspsm\",\"STK/m²\")","v":"pcs./m²"}]
[{"$f":"ml(\"ad_schrau4\",\"Schraubenstückzahl\")","v":"Nubmer of screws"},null,null,{"$f":"D57*Fläche_G","v":{"$error":"#NAME?"}},{"$f":"ml(\"ad_pcs\",\"STK\")","v":"pcs."}]
[]
[{"$f":"ml(\"ad_bereic3\",\"Bereich F\")","v":"Area F"}]
[{"$f":"ml(\"ad_schraubenabstand3\",\"Schraubenabstand Bereich F\")","v":"Screw distance area F"},null,null,{"$f":"e_sog_f","v":{"$error":"#NAME?"}},"cm",{"$f":"IF(e_max<D61,\"→ e max = \" & e_max & \" cm\",\"\")","v":{"$error":"#NAME?"}}]
[{"$f":"ml(\"ad_anzahl5\",\"Schrauben je lfm Sparren\")","v":"Screws per meter "},null,null,{"$f":"1/(MIN(e_max,D61)/100)","v":{"$error":"#NAME?"}},{"$f":"ml(\"ad_pcspm\",\"STK/m\")","v":"pcs./m"}]
[{"$f":"ml(\"ad_anzahl4.1\",\"Schrauben je m2 Dachfläche\")","v":"Screws per sqm [m²]"},null,null,{"$f":"D62/$D$10","v":{"$error":"#NAME?"}},{"$f":"ml(\"ad_pcspsm\",\"STK/m²\")","v":"pcs./m²"}]
[{"$f":"ml(\"ad_schrau4\",\"Schraubenstückzahl\")","v":"Nubmer of screws"},null,null,{"$f":"D63*Fläche_F","v":{"$error":"#NAME?"}},{"$f":"ml(\"ad_pcs\",\"STK\")","v":"pcs."}]
[]
[{"$f":"ml(\"ad_bereicJ\",\"Bereich J ( nur Satteldach)\")","v":"Area J (double pitched only)"}]
[{"$f":"ml(\"ad_schraubenabstand4\",\"Schraubenabstand Bereich J\")","v":"Screw distance area J"},null,null,{"$f":"IF(index_Dachform=1,e_sog_j,\"-\")","v":"-"},"cm",{"$f":"IF(e_max<D67,\"→ e max = \" & e_max & \" cm\",\"\")","v":"→ e max = 150 cm"}]
[{"$f":"ml(\"ad_anzahl5\",\"Schrauben je lfm Sparren\")","v":"Screws per meter "},null,null,{"$f":"IF(index_Dachform=1,1/(MIN(e_max,D67)/100),\"-\")","v":"-"},{"$f":"ml(\"ad_pcspm\",\"STK/m\")","v":"pcs./m"}]
[{"$f":"ml(\"ad_anzahl4.1\",\"Schrauben je m2 Dachfläche\")","v":"Screws per sqm [m²]"},null,null,{"$f":"IF(index_Dachform=1,D68/$D$10,\"-\")","v":"-"},{"$f":"ml(\"ad_pcspsm\",\"STK/m²\")","v":"pcs./m²"}]
[{"$f":"ml(\"ad_schrau4\",\"Schraubenstückzahl\")","v":"Nubmer of screws"},null,null,{"$f":"IF(index_Dachform=1,D69*Fläche_J,\"-\")","v":"-"},{"$f":"ml(\"ad_pcs\",\"STK\")","v":"pcs."}]
[]
[{"$f":"ml(\"ad_schrau_sog2\",\"Schraubenstückzahl Windsog\")","v":"Number of screws wind suction"},null,null,{"$f":"ROUNDUP(D52+D58+D64+IF(index_Dachform=1,D70,0),0)","v":{"$error":"#NAME?"}},{"$f":"ml(\"ad_pcs\",\"STK\")","v":"pcs."}]
[]
[{"$f":"ml(\"ad_schrau3\",\"Schrauben - Gesamtstückzahl\")","v":"Total number of screws"},null,null,{"$f":"D41+D72","v":{"$error":"#NAME?"}},{"$f":"ml(\"ad_pcs\",\"STK\")","v":"pcs."}]
[{"$f":"ml(\"ad_bedingt_text\",\"Bedingt durch konstruktive Gegebenheiten wie z.B. die Länge der Konterlatten, Lattenstöße, Gauben, Kehlen etc. kann sich die Anzahl der Schrauben um 10% bis 20% gegenüber dem angegebenen Wert erhöhen.\")","v":"Due to structural conditions such as the length of the counter-batten, joints, dormers, grooves etc., the number of screws can increase by 10% to 20% compared to the specified value."}]
[]
[{"$f":"ml(\"ad_bereic1\",\"Bereich H,I\")","v":"Area H, I"},{"$f":"TEXT(D51,\"0,00\")&\" \"&E51& \"       e=\" & MIN(D49,e_max)&\" cm \" & IF(beta=90,ml(\"ad_entlangF\",\"entlang der Traglatten\"),ml(\"ad_entlang\",\"entlang der Sparren\"))","v":{"$error":"#NAME?"}}]
[{"$f":"ml(\"ad_bereic2\",\"Bereich G\")","v":"Area G"},{"$f":"TEXT(D57,\"0,00\")&\" \"&E57& \"       e=\" & MIN(D55,e_max)&\" cm \" & IF(beta=90,ml(\"ad_entlangF\",\"entlang der Traglatten\"),ml(\"ad_entlang\",\"entlang der Sparren\"))","v":{"$error":"#NAME?"}}]
[{"$f":"ml(\"ad_bereic3\",\"Bereich F\")","v":"Area F"},{"$f":"TEXT(D63,\"0,00\")&\" \"&E63& \"       e=\" & MIN(D61,e_max)&\" cm \" & IF(beta=90,ml(\"ad_entlangF\",\"entlang der Traglatten\"),ml(\"ad_entlang\",\"entlang der Sparren\"))","v":{"$error":"#NAME?"}}]
[{"$f":"ml(\"ad_bereic\",\"Bereich J\")","v":"Area J"}]
[{"$f":"ml(\"ad_dachscu\",\"Dachschub\")","v":"Roof shear"},{"$f":"TEXT(D39,\"0,00\")&\" \"&TEXT(E39,\"0\")&\"   \"&\" e= \"&TEXT(D34,\"0,00\")&\" cm\"& IF(beta=90,ml(\"ad_entlangF\",\"entlang der Traglatten\"),ml(\"ad_entlang\",\"entlang der Sparren\"))","v":"1,02 pcs./m²    e= 175,00 cm along the battens"}]
[]
[{"$f":"ml(\"ad_nachwe\",\"Nachweise und Auslastungen\")","v":"Design and utilization"}]
[{"$f":"ml(\"ad_schrau_schub\",\"Schrauben Dachschub\")","v":"Screws roof shear"},null,null,{"$f":"'calculation hard'!B56","v":{"$error":"#NAME?"}}]
[{"$f":"ml(\"ad_schrau_sog\",\"Schrauben Windsog\")","v":"Screws wind suction"},null,null,{"$f":"'calculation hard'!B70","v":{"$error":"#NAME?"}}]
[{"$f":"ml(\"ad_konter_grundl\",\"Konterlatte / Grundlatte\")","v":"Counter-batten"},null,null,{"$f":"'calculation hard'!B91","v":1.0119012827349514}]
[{"$f":"ml(\"ad_dämmun\",\"Dämmung\")","v":"Insulation"},null,null,{"$f":"'calculation hard'!B96","v":8.0509267701147816E-2}]

{"sheet":"calculation soft","index":6,"n_rows":91,"n_cols":12,"rows_kept":91,"cut":false,"hidden":true,"merged":[[3,1,3,7],[4,1,4,7]]}
[{"$f":"ml(\"ad_aufdac\",\"Aufdachdämmsystem: Berechnungsdetails und Nachweise\")","v":"Thermal Insulation system: Calculation Details and Design"}]
[{"$f":"ml(\"ad_auf gr\",\"auf Grundlage von  {2} mit {3}\", \"Z-9.1-509\",\"ETA-12/0373\",\"EN 1995-1-1\",\"B 1995-1-1\")","v":"based on ETA-12/0373 and EN 1995-1-1 with B 1995-1-1"}]
[null,null,null,null,null,null,null,null,null,null,{"$f":"Version","v":"V 26.03.01"}]
[{"$f":"ml(\"ad_bauvorhaben\",\"Bauvorhaben\")","v":"Project"},{"$f":"IF('Thermal insulation'!B4=\"\",\"\",'Thermal insulation'!B4)","v":""}]
[{"$f":"ml(\"tc_pos.nr\",\"Pos.Nr.:\")","v":"Pos. No.:"},{"$f":"IF('Thermal insulation'!B5=\"\",\"\",'Thermal insulation'!B5)","v":""}]
[]
[{"$f":"ml(\"tc_lastzu\",\"Lastzusammenstellung - Lastfallkombinationen\")","v":"Load combinations"}]
[]
[{"$f":"ml(\"tc_berech\",\"Berechnungswerte für Eigengewicht\")","v":"Calculation values of dead loads"}]
[]
[null,null,null,{"$f":"ml(\"ad_rohdic\",\"Rohdichte\")","v":"Bulk Density"},350,"kg/m3"]
[]
[null,null,null,null,null,"[KN/m]","​ɣ​","kmod","ψ0"]
[{"$f":"'Thermal insulation'!$F$39","v":"Covering and lathing"},null,null,null,"g1 k",{"$f":"gk*b_e","v":0.18}]
[{"$f":"ml(\"ad_dämmun1\",\"Dämmung + Konterlatte/Grundlatte\")","v":"Insulation + Counter-Batten"},null,null,null,"g2 k",{"$f":"(vba_g2k+vba_g3k)*b_e","v":5.0249999999999996E-2}]
[{"$f":"ml(\"tc_ständi2_\",\"Ständige Lasten Gesamt\")","v":"Total permanent loads"},null,null,null,"g k",{"$f":"SUM(F14:F15)","v":0.23024999999999998},"1,35/ 0,9",0.6,"-"]
[{"$f":"ml(\"ad_nutzla\",\"Nutzlast \")","v":"Live load"},null,null,null,"n k",{"$f":"nk*b_e","v":0.6},1.5,0.9,0]
[{"$f":"ml(\"ad_schneelast\",\"Schneelast\")","v":"Snow load"},null,null,null,"s k",{"$f":"sk*b_e","v":0.96},1.5,{"$f":"IF(index_sHöhe=1,0.8,0.9)","v":0.9},{"$f":"IF(index_sHöhe=1,0.7,0.5)","v":0.5}]
[{"$f":"ml(\"ad_winddruck\",\"Winddruck\")","v":"Wind pressure"},null,null,null,"w D,k",{"$f":"wdk*b_e","v":0.5904012964750841},1.5,1,0.6]
[{"$f":"ml(\"ad_windsog\",\"Windsog\")","v":"Wind suction"},null,null,null,"w S,k",{"$f":"wsk*b_e","v":-1.1808025929501682},1.5,1,0.6]
[]
[{"$f":"ml(\"ad_maßgeb\",\"maßgebende Kombination - Lasten vertikal bezogen auf die schräge Länge\")","v":"Leading combination - loads vertical based on the oblique length"}]
[]
[null,null,null,null,{"$f":"INDEX(data_lk_schräg,index_lk_schräg,1)","v":"g"}]
[null,null,null,"k mod",{"$f":"INDEX(data_lk_schräg,index_lk_schräg,6)","v":0.6}]
[null,null,null,"q d ",{"$f":"INDEX(data_lk_schräg,index_lk_schräg,7)","v":0.31083749999999999},"KN/m"]
[]
[{"$f":"ml(\"ad_maßgeb1\",\"maßgebende Kombination - Lasten normal zur Dachfläche (Windsog)\")","v":"Leading combination - loads normal to the roof surface (wind suction)"}]
[]
[null,null,null,null,{"$f":"INDEX(data_lk_schräg_sog,index_lk_schräg_sog,1)","v":"g2+wS"}]
[null,null,null,"k mod",{"$f":"INDEX(data_lk_sog,index_lk_sog,6)","v":1}]
[null,null,null,"q  d ⏊",{"$f":"INDEX(data_lk_schräg_sog,index_lk_schräg_sog,7)","v":-1.7712038894252522},"KN/m"]
[]
[{"$f":"ml(\"ad_nachweis\",\"NACHWEISFÜHRUNG\")","v":"DESIGN CALCULATION"}]
[]
[{"$f":"ml(\"ad_schrau5\",\"Schraubenabstände\")","v":"Screw distances"}]
[null,null,null,"A",{"$f":"abstand_a","v":175},"cm"]
[null,null,null,"B",{"$f":"abstand_b","v":5},"cm"]
[null,null,null,{"$f":"ml(\"ad_?? m,v\",\"ɣ​ m,Verbindungen\")","v":"ɣ​ m,connections"},{"$f":"cv(\"tc_gamM_V\",1.3,TRUE)","v":1.3},"[EE]"]
[]
[{"$f":"ml(\"ad_schrau_\",\"Schraubentragfähigkeit für Dachlasten\")","v":"Screw load bearing capacity for roof loads"}]
[]
[{"$f":"\"Schraube 1 (\" & IF(E48>=0,\"Zug\",\"Druck\")&\")\"","v":"Schraube 1 (Druck)"}]
[]
[{"$f":"IF(E48>0,\"Schraubenzugtragfähigkeit\",\"Schraubendrucktragfähigkeit\")","v":"Schraubendrucktragfähigkeit"}]
[null,null,null,null,null,null,null,{"$f":"IF(E48>0,\"\",\"R ki,d\")","v":"R ki,d"},{"$f":"IF(E48>0, \"\",\n    R_ki_d_1)","v":{"$error":"#NAME?"}},{"$f":"IF(E48>0,\"\",\"kN\")","v":"kN"},{"$f":"IF(E48>0,\"\",\"Knicken der Schraube\")","v":"Knicken der Schraube"},{"$f":"IF(E48<0,ml(\"ad_bemess\",\"Bemessungswerte der Tragfähigkeit der Schrauben aud Ausknicken Rki,d in Abhängigkeit von der freien Länge L der Schrauben zwischen den Holzteilen nach Tabelle 1 der allgmeinen bauaufsichtlichen Zulassung Z-9.1-509\"),\"\")","v":"Design values of the load-bearing capacity of the screws against buckling Rki,d as a function of the free length L of the screws between the timber parts in accordance with Table 1 of the general technical approval Z-9.1-509"}]
[null,null,null,null,null,null,null,{"$f":"IF(E48>0,\"\",\"L\")","v":"L"},{"$f":"IF(E48>0,    \"\",    L_s_dä_druck)","v":311.76914536239792},{"$f":"IF(E48>0,\"\",\"mm\")","v":"mm"},{"$f":"IF(E48>0,\"\",\"freie Länge\")","v":"freie Länge"}]
[null,{"$f":"IF(E48<0,ABS(E48)/MIN(I46,I48),ABS(E48)/I48)","v":{"$error":"#NAME?"}},null,"S 1,d",{"$f":"N_Schraube_1","v":-0.55950749999999982},"KN",null,"R ax,d",{"$f":"MIN(f_1_k_weich_druck*vba_Schraube_d*l_ef_L_druck,f_1_k_weich_druck*vba_Schraube_d*l_ef_UK_druck)/1000*kmod_schräg/1.3","v":{"$error":"#NAME?"}},"KN",{"$f":"IF(E48>0,\"Ausziehen Gewinde\",\"Eindrücken Gewinde\")","v":"Eindrücken Gewinde"}]
[null,null,null,null,null,null,null,"f ax,α,k",{"$f":"f_axka(vba_Schraube_fhk,alpha_1_weich,roh_holz)","v":{"$error":"#NAME?"}},"N/mm2",{"$f":"ml(\"ad_auszie\",\"Ausziehparameter\")","v":"Extensible parameter"}]
[]
[{"$f":"\"Schraube 2 (\" & IF(E56>=0,\"Zug\",\"Druck\")&\")\"","v":"Schraube 2 (Zug)"}]
[]
[{"$f":"IF(E56>0,\"Schraubenzugtragfähigkeit\",\"Schraubendrucktragfähigkeit\")","v":"Schraubenzugtragfähigkeit"}]
[null,null,null,null,null,null,null,{"$f":"IF(E56>0,\"\",\"R ki,d\")","v":""},{"$f":"IF(E56>0, \"\",\n    R_ki_d_2)","v":""},{"$f":"IF(E56>0,\"\",\"kN\")","v":""},{"$f":"IF(E56>0,\"\",ml(\"ad_knicke\",\"Knicken der Schraube\"))","v":""},{"$f":"IF(E56<0,\"Bemessungswerte der Tragfähigkeit der Schrauben aud Ausknicken Rki,d in Abhängigkeit von der freien Länge L der Schrauben zwischen den Holzteilen nach Tabelle 1 der allgmeinen bauaufsichtlichen Zulassung Z-9.1-509\",\"\")","v":""}]
[null,null,null,null,null,null,null,{"$f":"IF(E56>0,\"\",\"L\")","v":""},{"$f":"IF(E56>0,    \"\",    L_s_dä_zug)","v":""},{"$f":"IF(E56>0,\"\",\"mm\")","v":""},{"$f":"IF(E56>0,\"\",ml(\"ad_freie \",\"freie Länge\"))","v":""}]
[null,{"$f":"IF(E56<0,ABS(E56)/MIN(I54,I56),ABS(E56)/I56)","v":{"$error":"#NAME?"}},null,"S 2,d",{"$f":"N_Schraube_2","v":0.55950750000000005},"KN",null,"R ax,d",{"$f":"MIN(f_1_k_weich_zug*vba_Schraube_d*l_ef_l_zug,f_1_k_weich_zug*vba_Schraube_d*l_ef_UK_zug)/1000*kmod_schräg/1.3","v":{"$error":"#NAME?"}},"KN",{"$f":"IF(E56>0,ml(\"ad_auszie3\",\"Ausziehen Gewinde\"),ml(\"ad_eindrü\",\"Eindrücken Gewinde\"))","v":"thread pull out"}]
[null,null,null,null,null,null,null,"f ax,α,k",{"$f":"f_axka(vba_Schraube_fhk,alpha_2_weich,roh_holz)","v":{"$error":"#NAME?"}},"N/mm2",{"$f":"ml(\"ad_auszie\",\"Ausziehparameter\")","v":"Extensible parameter"}]
[]
[{"$f":"ml(\"ad_windss12\",\"Windsogsicherung durch die Schrauben 1 und 2\")","v":"Wind suction protection with screws 1 and 2"}]
[null,null,null,null,null,null,null,{"$f":"IF(E62>0,\"\",\"R ki,d\")","v":"R ki,d"},{"$f":"IF(E62>0, \"\",\n    R_ki_d_1)","v":{"$error":"#NAME?"}},{"$f":"IF(E62>0,\"\",\"kN\")","v":"kN"},{"$f":"IF(E62>0,\"\",\"Knicken der Schraube\")","v":"Knicken der Schraube"}]
[{"$f":"ml(\"ad_schraun\",\"Schraube {0}\",\"1\")","v":"Screw 1"},null,null,null,null,null,null,{"$f":"IF(E62>0,\"\",\"L\")","v":"L"},{"$f":"IF(E62>0,    \"\",    L_s_dä_druck)","v":311.76914536239792},{"$f":"IF(E62>0,\"\",\"mm\")","v":"mm"},{"$f":"IF(E62>0,\"\",\"freie Länge\")","v":"freie Länge"}]
[null,{"$f":"IF(E62<0,ABS(E62)/MIN(I60,I62),ABS(E62)/I62)","v":{"$error":"#NAME?"}},null,"S 1,ws,d",{"$f":"N_Schraube_1_ws","v":-8.1404999999999852E-2},"KN",null,"R ax,d",{"$f":"MIN(f_1_k_weich_druck*vba_Schraube_d*l_ef_L_druck,f_1_k_weich_druck*vba_Schraube_d*l_ef_UK_druck)/1000*kmod_schräg/1.3","v":{"$error":"#NAME?"}},"KN",{"$f":"IF(E62>0,ml(\"ad_auszie3\",\"Ausziehen Gewinde\"),ml(\"ad_eindrü\",\"Eindrücken Gewinde\"))","v":"thread press-in"}]
[null,null,null,null,null,null,null,"f ax,α,k",{"$f":"f_axka(vba_Schraube_fhk,alpha_1_weich,roh_holz)","v":{"$error":"#NAME?"}},"N/mm2",{"$f":"ml(\"ad_auszie\",\"Ausziehparameter\")","v":"Extensible parameter"}]
[]
[{"$f":"ml(\"ad_schraun\",\"Schraube {0}\",\"2\")","v":"Screw 2"}]
[null,{"$f":"E66/I66","v":{"$error":"#NAME?"}},null,"S 2,ws,d",{"$f":"N_Schraube_2_ws","v":8.1405000000000102E-2},"KN",null,"R ax,d",{"$f":"MIN(f_1_k_weich_zug*vba_Schraube_d*l_ef_l_zug,f_1_k_weich_zug*vba_Schraube_d*l_ef_UK_zug)/1000*kmod_schräg/1.3","v":{"$error":"#NAME?"}},"KN",{"$f":"IF(E66>0,ml(\"ad_auszie3\",\"Ausziehen Gewinde\"),ml(\"ad_eindrü\",\"Eindrücken Gewinde\"))","v":"thread pull out"}]
[null,null,null,null,null,null,null,"f ax,α,k",{"$f":"f_axka(vba_Schraube_fhk,alpha_2_weich,roh_holz)","v":{"$error":"#NAME?"}},"N/mm2",{"$f":"ml(\"ad_auszie\",\"Ausziehparameter\")","v":"Extensible parameter"}]
[]
[{"$f":"ml(\"ad_biegeb\",\"Biegebeanspruchung der Konterlatten / Grundlatten\")","v":"Bending stress restraning lath"}]
[]
[{"$f":"ml(\"ad_unendl\",\"Unendlicher Durchlaufträger über zwei Felder\")","v":"Infinite continuous beam over two fields"}]
[]
[{"$f":"ml(\"ad_einwir\",\"Einwirkung\")","v":"Action"},null,null,{"$f":"IF(M_max_schräg>=M_max_schräg_ws,\"q d\",\"q d ⏊\")","v":"q d"},{"$f":"IF(M_max_schräg>=M_max_schräg_ws,qd_schräg,qd_schräg_sog)","v":0.31083749999999999},"KN/m",null,null,null,null,null,{"$f":"ml(\"tc_maßgeb\",\"maßgebende Kombination\")","v":"Decisive combination"}]
[]
[{"$f":"ml(\"ad_system\",\"System\")","v":"System"},null,null,"B",{"$f":"abstand_b","v":5},"cm"]
[null,null,null,"A",{"$f":"abstand_a","v":175},"cm"]
[]
[null,null,null,"α 1",{"$f":"alpha_1_weich","v":60},"°"]
[null,null,null,"α 2",{"$f":"alpha_2_weich","v":60},"°"]
[]
[{"$f":"ml(\"ad_moment\",\"Momente\")","v":"Moments"},null,null,"M A,d",{"$f":"IF(M_max_schräg>=M_max_schräg_ws,INDEX(data_M_KL,1,2),INDEX(data_M_KL_wsog,1,2))","v":2.5645987142108695E-18},"KNm"]
[null,null,null,"M B,d",{"$f":"IF(M_max_schräg>=M_max_schräg_ws,INDEX(data_M_KL,2,2),INDEX(data_M_KL_wsog,2,2))","v":-1.1777201250886993E-2},"KNm"]
[null,null,null,"M C,d",{"$f":"IF(M_max_schräg>=M_max_schräg_ws,INDEX(data_M_KL,3,2),INDEX(data_M_KL_wsog,3,2))","v":1.1777201250886982E-2},"KNm"]
[null,null,null,"M D,d",{"$f":"IF(M_max_schräg>=M_max_schräg_ws,INDEX(data_M_KL,4,2),INDEX(data_M_KL_wsog,4,2))","v":2.5645987142108695E-18},"KNm"]
[]
[{"$f":"ml(\"ad_konter\",\"Konterlatten / Grundlatten\")","v":"Counter-batten"}]
[{"$f":"ml(\"ad_festig\",\"Festigkeitsklasse\")","v":"Strength class"},null,null,null,{"$f":"Fest_KL","v":"C24"}]
[null,null,null,"b/ h",{"$f":"TEXT(b_kl,\"0\") & \" / \" & TEXT(h_kl,\"0\")","v":"5 / 3"},"cm"]
[null,null,null,"W y",{"$f":"(b_kl*h_kl^2)/6","v":7.5},"cm3"]
[]
[null,{"$f":"E91/I91","v":0.14176260764956569},null,"σ m,d",{"$f":"MAX(ABS(E81),ABS(E82),ABS(E83),ABS(E84))*100/E89","v":0.15702935001182658},"KN/cm2",null,"f m,d",{"$f":"(fmk/10)*IF(M_max_schräg>=M_max_schräg_ws,kmod_schräg,E31)/1.3","v":1.1076923076923075},"KN/cm2"]

{"sheet":"calculation hard","index":7,"n_rows":96,"n_cols":12,"rows_kept":96,"cut":false,"hidden":false,"merged":[[3,1,3,7],[4,1,4,7]]}
[{"$f":"ml(\"ad_aufdac\",\"Aufdachdämmsystem: Berechnungsdetails und Nachweise\")","v":"Thermal Insulation system: Calculation Details and Design"}]
[{"$f":"ml(\"ad_bem2\",\"auf Grundlage von {1} und {2} mit {3}\",\"Z-9.1-509\",\"ETA-12/373\",\"EN 1995-1-1\",\"B 1995-1-1\")","v":"based on ETA-12/373 and EN 1995-1-1 with B 1995-1-1"}]
[null,null,null,null,null,null,null,null,null,null,{"$f":"Version","v":"V 26.03.01"}]
[{"$f":"ml(\"ad_bauvorhaben\",\"Bauvorhaben\")","v":"Project"},{"$f":"IF('Thermal insulation'!B4=\"\",\"\",'Thermal insulation'!B4)","v":""}]
[{"$f":"ml(\"tc_pos.nr\",\"Pos.Nr.:\")","v":"Pos. No.:"},{"$f":"IF('Thermal insulation'!B5=\"\",\"\",'Thermal insulation'!B5)","v":""}]
[]
[{"$f":"ml(\"tc_lastzu\",\"Lastzusammenstellung - Lastfallkombinationen\")","v":"Load combinations"}]
[]
[{"$f":"ml(\"tc_berech\",\"Berechnungswerte für Eigengewicht\")","v":"Calculation values of dead loads"}]
[]
[null,null,null,{"$f":"ml(\"ad_rohdic\",\"Rohdichte\")","v":"Bulk Density"},350,"kg/m3"]
[]
[null,null,null,null,null,"[KN/m]","​ɣ​","kmod","ψ0"]
[{"$f":"'Thermal insulation'!$F$39","v":"Covering and lathing"},null,null,null,"g1 k",{"$f":"gk*b_e","v":0.18}]
[{"$f":"ml(\"ad_dämmun1\",\"Dämmung + Konterlatte\")","v":"Insulation + Counter-Batten"},null,null,null,"g2 k",{"$f":"(vba_g2k+vba_g3k)*b_e","v":5.0249999999999996E-2}]
[{"$f":"ml(\"tc_ständi2_\",\"Ständige Lasten Gesamt\")","v":"Total permanent loads"},null,null,null,"g k",{"$f":"SUM(F14:F15)","v":0.23024999999999998},"1,35/ 0,9",0.6,"-",{"$f":"ml(\"ad_schräg\",\"schräg\")","v":"oblique"}]
[{"$f":"ml(\"ad_nutzla\",\"Nutzlast \")","v":"Live load"},null,null,null,"n k",{"$f":"nk*b_e","v":0.6},1.5,0.9,0,{"$f":"ml(\"ad_horiz.\",\"horiz.proj.\")","v":"horiz. Proj."}]
[{"$f":"ml(\"ad_schneelast\",\"Schneelast\")","v":"Snow load"},null,null,null,"s k",{"$f":"sk*b_e","v":0.96},1.5,{"$f":"IF(index_sHöhe=1,0.8,0.9)","v":0.9},{"$f":"IF(index_sHöhe=1,0.7,0.5)","v":0.5},{"$f":"ml(\"ad_horiz.\",\"horiz.proj.\")","v":"horiz. Proj."}]
[{"$f":"ml(\"ad_winddruck\",\"Winddruck\")","v":"Wind pressure"},null,null,null,"w D,k",{"$f":"wdk*b_e","v":0.5904012964750841},1.5,1,0.6,{"$f":"ml(\"ad_normal\",\"normal\")","v":"normal"}]
[{"$f":"ml(\"ad_windsog\",\"Windsog\")","v":"Wind suction"},null,null,null,"w S,k",{"$f":"wsk*b_e","v":-1.1808025929501682},1.5,1,0.6,{"$f":"ml(\"ad_normal\",\"normal\")","v":"normal"}]
[]
[{"$f":"ml(\"tc_maßgeb\",\"maßgebende Kombination\")","v":"Decisive combination"}]
[{"$f":"ml(\"ad_lasten1\",\"Lasten parallel zur Dachfläche (Dachschub zur Dimensionierung der geneigten Schrauben)\")","v":"Loads parallel to the roof surface (roof shear forces for dimensioning the inclined screws)"},null,null,null,null,null,null,null,null,null,null,{"$f":"ml(\"ad_last_text\",\"Lastaufteilung für Bauteile geneigter Dachflächen nach\") & \" Neuhaus: Ingenieurholzbau, 3. Auflage, S.181 (Tab. 9.5)\"","v":"Distribution of loads for inclinated roof surfaces according to Neuhaus: Ingenieurholzbau, 3. Auflage, S.181 (Tab. 9.5)"}]
[]
[null,null,null,null,{"$f":"INDEX(data_lk_schub,index_lk_schub,1)","v":"g"}]
[null,null,null,"k mod",{"$f":"INDEX(data_lk_schub,index_lk_schub,6)","v":0.6},null,null,"NAT"]
[]
[null,null,null,"q d //",{"$f":"INDEX(data_lk_schub,index_lk_schub,7)","v":0.31083749999999999},"KN/m"]
[]
[{"$f":"ml(\"tc_maßgeb\",\"maßgebende Kombination\")","v":"Decisive combination"}]
[{"$f":"ml(\"ad_lasten2\",\"Lasten normal zur Dachfläche (Windsog zur Dimensionierung der rechtwinkelig zur Dachfläche angeordneten Zugschrauben)\")","v":"Loads normal to the roof surface (wind suction for dimensioning the screws with tension force arranged with an right angle to the roof surface)"}]
[]
[null,null,null,null,{"$f":"INDEX(data_lk_sog,index_lk_sog,1)","v":"g2+wS"}]
[null,null,null,"k mod",{"$f":"INDEX(data_lk_sog,index_lk_sog,6)","v":1},null,null,"NAT"]
[]
[null,null,null,"q d ⏊",{"$f":"INDEX(data_lk_sog,index_lk_sog,7)","v":-1.7712038894252522},"KN/m"]
[]
[{"$f":"ml(\"tc_maßgeb\",\"maßgebende Kombination\")","v":"Decisive combination"}]
[{"$f":"ml(\"ad_lasten3\",\" Lasten normal zur Dachfläche (Druck zur Dimensionierung von Konterlattung und Dämmung)\")","v":"Loads normal to the surface (Pressure for dimensioning counter-battening and insulation)"}]
[]
[null,null,null,null,{"$f":"INDEX(data_lk_druck,index_lk_druck,1)","v":"g+wD"}]
[null,null,null,"k mod",{"$f":"INDEX(data_lk_druck,index_lk_druck,6)","v":1},null,null,"NAT"]
[]
[null,null,null,"q d ⏊",{"$f":"INDEX(data_lk_druck,index_lk_druck,7)","v":0.8856019447126261},"KN/m"]
[]
[]
[{"$f":"ml(\"ad_nachweis\",\"NACHWEISFÜHRUNG\")","v":"DESIGN CALCULATION"}]
[]
[{"$f":"ml(\"ad_schrau\",\"Schraubenabstand\")","v":"Screw distance"}]
[null,null,null,"A",{"$f":"abstand_a","v":175},"cm"]
[]
[null,null,null,{"$f":"ml(\"ad_?? m,v\",\"ɣ​ m,Verbindungen\")","v":"ɣ​ m,connections"},{"$f":"cv(\"tc_gamM_V\",1.3,TRUE)","v":1.3},"[EE]"]
[null,null,null,"​​"]
[{"$f":"ml(\"ad_auszie2\",\"Ausziehwiderstand\")","v":"Extensible resistance"},null,null,null,null,null,null,{"$f":"vba_Screw","v":"ESSVE CY-FT  8,0 x 450/427"}]
[]
[null,{"$f":"E56/I56","v":{"$error":"#NAME?"}},null,"S ax,d",{"$f":"qd_schub*(abstand_a/100)/COS(alpha*PI()/180)","v":1.0879312499999998},"KN",null,"R ax,d",{"$f":"MIN(f1_k*vba_Schraube_d*l_ef_Uk*k_1*k_2,MAX(f2_k*vba_Schraube_dk^2,f1_k*l_ef_L*vba_Schraube_d))*kmod_schub/$E$52/1000","v":{"$error":"#NAME?"}},"KN",{"$f":"ml(\"ad_auszie2\",\"Ausziehwiderstand\")","v":"Extensible resistance"}]
[]
[null,null,null,null,null,null,null,"f ax,α,k",{"$f":"f_axka(vba_Schraube_fhk,alpha,roh_holz)","v":{"$error":"#NAME?"}},"N/mm2",{"$f":"ml(\"ad_auszie\",\"Ausziehparameter\")","v":"Extensible parameter"}]
[null,null,null,null,null,null,null,"f head,k",{"$f":"Listen!$G$44","v":0},"N/mm2",{"$f":"ml(\"ad_kopfdu2\",\"Kopfdurchziehfestigkeit\")","v":"Screwhead pull-through strength"}]
[null,null,null,null,null,null,null,"k1",{"$f":"MIN(1,220/(vba_dDAE))","v":0.81481481481481477},"[-]",{"$f":"ml(\"ad_beiwer\",\"Beiwert \")","v":"additional Value"}]
[null,null,null,null,null,null,null,"k2",{"$f":"MIN(1,(vba_sig10/0.12))","v":1},"[-]",{"$f":"ml(\"ad_beiwer\",\"Beiwert \")","v":"additional Value"}]
[]
[{"$f":"ml(\"ad_windso\",\"Windsogsicherung\")","v":"Wind suction securing"}]
[]
[{"$f":"ml(\"ad_windso2\",\"Windsogsicherung über Schrauben rechtwinkelig zur Dachfläche\")","v":"Wind suction securing through screws rectangular to the roof surface"},null,null,null,null,null,null,{"$f":"vba_Screw_2","v":"Essve C-PT  8,0 x 300/100"}]
[{"$f":"ml(\"ad_erford\",\"Erforderlicher Schraubenabstand\")","v":"Required distance between screws"}]
[null,null,null,{"$f":"ml(\"ad_e sog,\",\"e sog,erf.\")","v":"e suc,nec."},{"$f":"ROUNDDOWN(R_ax_sog/qd_ws*-1*100,0)","v":{"$error":"#NAME?"}},"cm"]
[{"$f":"ml(\"ad_schrau_n\",\"Schraubenneigung\")","v":"Screw inclination"},null,null,"α 1",90,"°"]
[null,null,null,null,null,null,null,"f ax,α1,k",{"$f":"f_axka(vba_Schraube_fhk_2,alpha_1,roh_holz)","v":{"$error":"#NAME?"}},"N/mm2"]
[null,{"$f":"IF(R_ax_sog=0,9.99,ABS(E70/R_ax_sog))","v":{"$error":"#NAME?"}},null,"W s,d",{"$f":"qd_ws*e_sog/100","v":{"$error":"#NAME?"}},"KN",null,"R ax,d",{"$f":"(MIN(I69*vba_Schraube_d_2*l_ef_Uk*k_1*k_2,MAX(f2_k*vba_Schraube_dk_2^2,f1_k*l_ef_L*10*vba_Schraube_d_2)))*kmod_ws/$E$52/1000","v":{"$error":"#NAME?"}},"KN",{"$f":"CHOOSE(IF(R_ax_sog=I69*vba_Schraube_d*l_ef_Uk*k_1*k_2*kmod_ws/$E$52/1000,1,\nIF(R_ax_sog=f2_k*vba_Schraube_dk^2*kmod_ws/$E$52/1000,2,\nIF(R_ax_sog=f1_k*l_ef_L*10*vba_Schraube_d*kmod_ws/$E$52/1000,3,4))),\nml(\"ad_ausunt\",\"Ausziehen Unterkonstruktion\"),\nml(\"ad_kopf\",\"Kopfdurchziehen\"),\nml(\"ad_auskon\",\"Ausziehen Konterlatte\"),\"\")","v":{"$error":"#NAME?"}}]
[]
[{"$f":"ml(\"ad_bieges\",\"Biegespannung der Konterlatten / Grundlatten\")","v":"Flexural stress in the counter-battening and lathing"}]
[]
[{"$f":"ml(\"ad_konter_grundl\",\"Konterlatte / Grundlatte\")","v":"Counter-batten"}]
[{"$f":"ml(\"ad_festig\",\"Festigkeitsklasse\")","v":"Strength class"},null,null,null,{"$f":"Fest_KL","v":"C24"}]
[null,null,null,"E 0,mean",{"$f":"E_0_mean","v":11000},"N/mm2"]
[null,null,null,"b/ h",{"$f":"TEXT(b_kl,\"0\") & \" / \" & TEXT(h_kl,\"0\")","v":"5 / 3"},"cm"]
[null,null,null,"I y",{"$f":"(b_kl*h_kl^3)/12","v":11.25},"cm4"]
[null,null,null,"W y",{"$f":"(b_kl*h_kl^2)/6","v":7.5},"cm3"]
[]
[{"$f":"ml(\"ad_bettun\",\"Bettung durch den Dämmstoff\")","v":"Bedding caused from the insulation"}]
[{"$f":"ml(\"ad_dicke\",\"Dicke\")","v":"Thickness"},null,null,"d Dä",{"$f":"vba_dDAE2","v":250},"mm"]
[{"$f":"ml(\"ad_e-modu\",\"E-Modul\")","v":"Young´s modulus"},null,null,"E D,c,mean",{"$f":"vba_EDCMean","v":2.8},"N/mm2"]
[]
[{"$f":"ml(\"ad_bettun1\",\"Bettungsbreite\")","v":"Bedding variety"},null,null,"b bet",{"$f":"b_kl+vba_dDAE2/20","v":17.5},"cm"]
[{"$f":"ml(\"ad_bettun2\",\"Bettungsziffer\")","v":"Subgrade moduli"},null,null,"k",{"$f":"vba_EDCMean/vba_dDAE2","v":1.12E-2},"N/mm3"]
[{"$f":"ml(\"ad_char. \",\"Char. Länge\")","v":"Char. Length"},null,null,"l char",{"$f":"((4*(E_KL/10)*I_y)/(k_dä*b_bet))^(1/4)","v":22.417505340589692},"cm"]
[null,null,null,"Q k",{"$f":"Q_k","v":1.5},"kN"]
[{"$f":"ml(\"ad_biegem\",\"Biegemoment\")","v":"Flexural moment"},null,null,"M d",{"$f":"Q_k*1.5*l_char/4","v":12.609846754081701},"KNcm"]
[]
[null,{"$f":"E91/J91","v":1.0119012827349514},null,"σ m,d",{"$f":"M_d/W_y","v":1.6813129005442269},"KN/cm2",null,"f m,d",null,{"$f":"(fmk/10)*0.9/1.3","v":1.6615384615384616},"KN/cm2"]
[]
[{"$f":"ml(\"ad_pressu\",\"Pressung der Dämmung\")","v":"Compression of the insulation"}]
[null,null,null,{"$f":"\"q d\" &ml(\"ad_normal2\",\" normal\")","v":"q d normal"},{"$f":"qd_wd","v":0.8856019447126261},"KN/m"]
[null,null,null,null,null,null,null,{"$f":"ml(\"ad_zuläss\",\"zulässige Pressung\")","v":"Allowed compression"}]
[null,{"$f":"E96/J96","v":8.0509267701147816E-2},null,"σ c,d",{"$f":"(qd_wd/100)/b_kl*10","v":1.7712038894252522E-2},"N/mm2",null,"f c,d",null,{"$f":"1.1*vba_sig10","v":0.22000000000000003},"N/mm2"]

{"sheet":"Vokabel","index":8,"n_rows":872,"n_cols":14,"rows_kept":872,"cut":false,"hidden":true,"merged":[]}
["Nationale Festlegungen"]
["Schlüssel","AT","GB","IT","DE","EE"]
["tc_alpha_cc",1,0.85,0.85,0.85,0.85,null,"long-term effects on the compressive strength"]
["tc_gamM_C",1.3,1.3,1.5,1.3,1.3,null,"Partial material safety factor - Solid Timber"]
["tc_gamM_concr",1.5,1.5,1.5,1.5,1.5,null,"Partial material safety factor - Concrete"]
["tc_gamM_GL",1.25,1.25,1.45,1.25,1.25,null,"Partial material safety factor - Glulam"]
["tc_gamM_stahl",1.1499999999999999,1.1499999999999999,1.1499999999999999,1.1499999999999999,1.1499999999999999,null,"Partial material safety factor - Steel"]
["codeCaption","ON B 1995-1-1","BS NA 1995-1-1","UNI EN 1995-1-1","DIN NA 1995-1-1","EVS-EN 1995-1-1"]
["tc_gamM_V",1.3,1.3,1.5,1.3,1.3,null,"Material safety - Steel Connections"]
[]
["Vokabel"]
[null,null,null,null,null,"Estonia","Poland","Sweden","Norway","Finland","Latvia","Lithuania"]
["Deepl-Sprachkürzel",null,null,null,null,"ET"]
["Schlüssel","DE","EN","IT","FR","EE","PL","SE","NO","FI","LV","LT","CZ","Foglio di ingresso"]
["250425_a","Die Gewindelänge von Schraube {0} in der Konterlatte ist zu gering","The thread length of screw {0} in the counter plate is too short",null,null,"Kruvi {0} keermepikkus vastusplaadis on liiga lühike."]
["250425_b","Schraube {0} ist um {1} mm zu kurz!","Screw {0} is too short by {1} mm!",null,null,"Kruvi {0} on {1} mm võrra liiga lühike!",null,null,null,null,null,null,null,"Kommentar"]
["250425_c","Schraube {0} ist um {1} mm zu lang!","Screw {0} is too long by {1} mm!"]
["ad_?? m,v","ɣ​ m,Verbindungen","ɣ​ m,connections","ɣ​ m,giuntature","ɣ​ m,assemblages","?? m,ühendused"]
["ad_abmess_schrau","Abmessungen und Schraubenauswahl","Dimensions and Screws","misure e assortimento di viti","dimensions et choix des vis","Mõõtmed ja kruvide valik"]
["ad_achtung","ACHTUNG! VBA-Funktionen vom System gesperrt. Bitte Arbeitsmappe schließen und nochmals öffnen.","CAUTION! VBA functions blocked by the system. Please close the worksheet and open it again.","ATTENZIONE! Le funzioni VBA sono state bloccate dal sistema. Si prega di chiudere e quindi riaprire la cartella di lavoro.","ATTENTION !\nLes fonctions VBA sont bloquées par le système.\nVeuillez fermer et rouvrir le classeur.","TÄHELEPANU: VBA funktsioonid on süsteemi poolt lukustatud. Palun sulgege töövihik ja avage see uuesti."]
["ad_angabenvorbemssung","Angaben zur Vorbemessung","Input for preliminary design","indicazioni sul predimensionamento","informations relatives au prédimensionnement","Eelnev teave mõõtmete määramise kohta"]
["ad_anordn","Anordnung","Assembly","disposizione","répartition","Kokkulepe"]
["ad_anzahl1","Anzahl der Tragachsen","No. of member axis","numero di assi dei puntoni","nombre d’axes de chevron","Parvetelgede arv"]
["ad_anzahl2","Schrauben je Tragachse","Screws per member","numero di viti per asse di un puntone","nombre de vis par axe de chevron","Kruvide arv sarvetelje kohta"]
["ad_anzahl3","Schrauben je lfm ","Screws per meter member","numero di viti per metro lineare di asse di un puntone","nombre de vis par mètre linéaire d’axe de chevron","Kruvide arv ühe jooksva meetri sarvetelje kohta"]
["ad_anzahl4","Schrauben je m2 Fläche","Screws per square meter","numero di viti per m² di tetto","nombre de vis par m² de toiture","Kruvide arv katusepinna m2 kohta"]
["ad_anzahl4.1","Schrauben je m2 Fläche","Screws per sqm [m²]","viti per m² di tetto","vis par m² de toiture","Kruvid m2 katusepinna kohta"]
["ad_anzahl5","Schrauben je lfm Tragachse","Screws per meter ","viti per metro lineare di puntone","vis par mètre linéaire de chevron","Kruvid ühe jooksva meetri sarika kohta"]
["ad_asukon","Ausziehen Konterlatte","Extraction counter-batten","estrazione della vite dalla controlistellatura","arrachement de la vis (contre-latte)","Välja tõmmates counter batten"]
["ad_auf gr","auf Grundlage von {1} und {2} mit {3}","based on {1} and {2} with {3}","sulla base dell {1}, {2} e {3}","sur la base de {1}, {2} et {3}","{1} ja {2} alusel koos {3}-ga"]
["ad_auf gr","auf Grundlage von {1} und {2} mit {3}","based on {1} and {2} with {3}",null,"sur la base de {1}, {2} et {3}","{1} ja {2} alusel koos {3}-ga"]
["ad_aufdac","Aufdachdämmsystem: Berechnungsdetails und Nachweise","Thermal Insulation system: Calculation Details and Design","sistema d’isolamento all’estradosso: dettagli di calcolo e verifiche","système d’isolation sur toiture : calculs détaillés et vérifications","Katusele paigaldatav isolatsioonisüsteem: arvutuste üksikasjad ja kontrollimine"]
["ad_aufdachdaemmung","Aufdachdämmung","Thermal Insulation ","isolamento all’estradosso","isolation sur toiture","Katuse isolatsioon"]
["ad_aufdachdaemmung_zusammenfassung","Aufdachdämmsystem - Zusammenfassung","Thermal Insulation - Summary","sistema d’isolamento all’estradosso – sintesi","système d’isolation sur toiture – récapitulatif","Katusele paigaldatav isolatsioonisüsteem - kokkuvõte"]
["ad_aufdachstandort","Aufdachdämmsystem - Standort","Thermal Insulation - Construction Site ","sistema d’isolamento all’estradosso – ubicazione","système d’isolation sur toiture – emplacement","Katusele paigaldatav isolatsioonisüsteem - asukoht"]
["ad_aufdachsys","Aufdachsystem","Thermal Insulation System","sistema all’estradosso","système sur toiture","Katusekatuse süsteem"]
["ad_außendruckbeiwerte","Außendruckbeiwerte cpe,1","External pressure coefficient cpe,1","coefficienti di pressione esterna cpe,1","coefficients de pression extérieure cpe,1","Välissurve koefitsiendid cpe,1"]
["ad_außendruckbeiwerte_einfach","Außendruckbeiwerte nach B 1991-1-4 (vereinfachte Ermittlung)","External pressure coefficient acc. To B 1991-1-4 (simplified)","coefficienti di pressione esterna come da B 1991-1-4 (calcolo semplificato)","coefficients de pression extérieure selon B 1991-1-4 (calcul simplifié)","Välissurve koefitsiendid vastavalt B 1991-1-4 (lihtsustatud määramine)"]
["ad_ausunt","Ausziehen Unterkonstruktion","Extraction sub construction","estrazione della vite dalla sottostruttura","arrachement de la vis (sous-construction)","Välja tõmmatav aluskonstruktsioon"]
["ad_auszie","Ausziehparameter","Extensible parameter","parametro di estrazione","Coefficients de résistance à l’arrachement ","Ekstraheerimise parameetrid"]
["ad_auszie2","Ausziehwiderstand","Extensible resistance","resistenza all’estrazione","résistance à l’arrachement","Tõmbetugevus"]
["ad_auszie3","Ausziehen Gewinde","thread pull out",null,null,"Väljavõte lõngast"]
["ad_basisgeschwindigkeit","Basisgeschwindigkeit","Basic wind velocity","Basic wind velocity","Basic wind velocity","Basic wind velocity"]
["ad_batlen","Traglattenlänge","Battens length"]
["ad_battensspacing","Traglattenabstand","Battens spacing"]
["ad_bautei","Bauteile in offenen, überdachten Konstruktionen","Roofed outdoor constructions","elementi costruttivi inseriti in strutture aperte dotate di copertura","éléments utilisés dans des constructions ouvertes et abritées par un toit.","Komponendid avatud, katusega konstruktsioonides"]
["ad_bauvorhaben","Bauvorhaben","Project","progetto","projet","Ehitusprojekt"]
["ad_bedingt_text","Bedingt durch konstruktive Gegebenheiten wie z.B. die Länge der Konterlatten, Lattenstöße, Gauben, Kehlen etc. kann sich die Anzahl der Schrauben um 10% bis 20% gegenüber dem angegebenen Wert erhöhen.","Due to structural conditions such as the length of the counter-batten, joints, dormers, grooves etc., the number of screws can increase by 10% to 20% compared to the specified value.","A seconda delle caratteristiche costruttive specifiche, ad es. la lunghezza dei controlistelli, i giunti fra le assi, la presenza di abbaini, compluvi, ecc., il numero di viti richiesto può aumentare del 10% - 20% rispetto al valore indicato.","Le nombre de vis nécessaires peut dépasser de 10 à 20 % la quantité indiquée en fonction de la configuration de la construction, notamment de la longueur des contre-lattes, des joints entre lattes, des lucarnes, des noues, etc.","Tulenevalt konstruktsioonilistest tingimustest, nagu vastuliistude pikkus, liistuühendused, pööningud, orud jne, võib kruvide arv võrreldes ettenähtud väärtusega suureneda 10% kuni 20%."]
["ad_befestigunsvariante","Befestigungsvariante","Fixing method","variante di fissaggio","variante de fixation","Kinnitusvariant"]
["ad_beiwer","Beiwert ","additional Value","coefficiente ","coefficient","Koefitsient"]
["ad_belastung","Belastung","Load","carico","charge","Koormus"]
["ad_bem2","auf Grundlage von {1} und {2} mit {3}","based on {1} and {2} with {3}","sulla base del {1}, {2} e {3}","sur la base des {1}, {2} et {3}","{1} ja {2} alusel koos {3}-ga"]
["ad_bem2","auf Grundlage von {2} mit {3}","based on {1} and {2} with {3}","Progettazione di sistemi di isolamento del tetto basati su {2} con {3}","sur la base {1}, {2} et {3}","{2} alusel koos {3}"]
["ad_bemess","Bemessungswerte der Tragfähigkeit der Schrauben aud Ausknicken Rki,d in Abhängigkeit von der freien Länge L der Schrauben zwischen den Holzteilen nach Tabelle 1 der allgmeinen bauaufsichtlichen Zulassung Z-9.1-509","Design values of the load-bearing capacity of the screws against buckling Rki,d as a function of the free length L of the screws between the timber parts in accordance with Table 1 of the general technical approval Z-9.1-509",null,null,"Kruvide kandevõime arvutuslikud väärtused paindumisvastase koormuse Rki,d sõltuvalt puiduosade vaheliste kruvide vabast pikkusest L vastavalt üldise tehnilise tunnustuse Z-9.1-509 tabelile 1."]
["ad_bemessung_menue","Bemessung von Aufdachdämmsystemen auf Grundlage von {1} und {2} mit {3}","Design of Thermal-Insulation-Systems based on {1} and {2} with {3}","dimensionamento di sistemi d’isolamento all’estradosso sulla base del {1}, {2} e {3}","dimension des systèmes d’isolation sur toiture sur la base des {1}, {2} et {3}","Katusel asuvate isolatsioonisüsteemide dimensioneerimine {1} ja {2} alusel koos {3}-ga"]
["ad_bemessung_menue","Bemessung von Aufdachdämmsystemen auf Grundlage von {2} mit {3}","Design of Thermal-Insulation-Systems based on {2} with {3}",null,"dimension des systèmes d’isolation sur toiture sur la base {1}, {2} et {3}","Katusel asuvate isolatsioonisüsteemide dimensioneerimine {2} ja {3} alusel"]
["ad_berechnung","Berechnung","Calculation","calcolo","calcul","Arvutus"]
["ad_bereic","Bereich J","Area J","area J","zone de toit J","Piirkond J"]
["ad_bereic1","Bereich H,I","Area H, I","aree H, I","zone de toit H, I","Piirkond H,I"]
["ad_bereic2","Bereich G","Area G","area G","zone de toit G","Piirkond G"]
["ad_bereic3","Bereich F","Area F","area F","zone de toit F","Piirkond F"]
["ad_bereicJ","Bereich J ( nur Satteldach)","Area J (double pitched only)",null,null,"Piirkond J (ainult viilkatuse puhul)"]
["ad_bettun","Bettung durch den Dämmstoff","Bedding caused from the insulation","cedimento elastico del materiale isolante","encastrement dans l’isolant","Vooderdus läbi isolatsioonimaterjali"]
["ad_bettun1","Bettungsbreite","Bedding variety","larghezza del cedimento elastico","largeur d’encastrement","Voodipesu laius"]
["ad_bettun2","Bettungsziffer","Subgrade moduli","coefficiente del cedimento elastico","coefficient d’encastrement","Voodipesu number"]
["ad_biegeb","Biegebeanspruchung der Konterlatten / Grundlatten","Bending stress restraning lath",null,null,"Vastulattide / põhilattide paindepinged"]
["ad_biegem","Biegemoment","Flexural moment","momento flettente","moment de flexion","Paindemoment"]
["ad_bieges","Biegespannung der Konterlatten / Grundlatten","Flexural stress in the counter-battening and lathing","sollecitazione a flessione dei controlistelli/listelli di base","contrainte de flexion des contre-lattes/lattes principales","Vastulattide / põhilattide paindepinged"]
["ad_bieget_konter","Biegetragfähigkeit Konterlatte","Bending resistance restraning lath","resistenza alla flessione del controlistello","résistance à la flexion de la contre-latte","Paindekoormuse kandevõime vasturiiulid"]
["ad_char. ","Char. Länge","Char. Length","lunghezza caratteristica","longueur caractéristique","Char. Length"]
["ad_dachei","Dacheindeckung inkl. Lattung","Roof covering and lathing","copertura (compresa listellatura)","couverture, lattage compris","Katusekate, sh latid"]
["ad_dachei2","Dacheindeckung ","Roof covering","copertura ","couverture","Katusekate"]
["ad_dachei3","Deckschale inkl. Lattung","Covering and lathing"]
["ad_dachfl","Dachfläche","Roof area","superficie del tetto","surface de toiture","Katuse pindala"]
["ad_dachfo","Dachform","Roof shape","tipo di tetto","forme de toiture","Katusekuju"]
["ad_dachge","Dachgeometrie","Roof geometry ","geometria del tetto","géométrie du toit","Katusegeomeetria"]
["ad_dachge2","Abmessungen","Dimensions"]
["ad_dachne","Dachneigung","Roof inclination","pendenza del tetto","pente de toit","Katusekalle"]
["ad_dachsc","Dachschubsicherung","Shear securing","sicurezza contro la forza di taglio agente sul tetto","sécurité contre les forces de cisaillement sur toiture","Katuse nihkekaitse"]
["ad_dachsc_windsog","Dachschubsicherung und Windsogsicherung","Shear and wind suction securing","sicurezza contro la forza di taglio agente sul tetto e la suzione del vento","sécurité contre les forces de succion du vent et les forces de cisaillement sur toiture","Katuse nihke- ja tuuletõmbekaitse"]
["ad_dachscu","Dachschub","Roof shear","forza di taglio agente sul tetto","forces de cisaillement sur toiture","Katusetõmbed"]
["ad_dämm1","Druckfeste Dämmung","Hard Insulation","isolante rigido","isolant rigide","Survekindel isolatsioon"]
["ad_dämm2","Weiche Dämmung","Soft Insulation","isolante flessibile","isolant souple","Pehme isolatsioon"]
["ad_dämmst","Dämmstoff","Insulation","isolante termico","matériau isolant","Isolatsioonimaterjal"]
["ad_dämmun","Dämmung","Insulation","isolamento","isolation","Isolatsioon"]
["ad_dämmun1","Dämmung + Konterlatte/Grundlatte","Insulation + Counter-Batten","isolamento + controlistello/listello di base","isolant + contre-latte/latte principale","Isolatsioon + vastulatt/aluselatt"]
["ad_datumgr","DATUM:","DATE:","DATA:","DATE .","KUUPÄEV:"]
["ad_dicke","Dicke","Thickness","spessore","épaisseur","Paksus"]
["ad_druck","Druck","Pressure","compressione","compression","Surve"]
["ad_drucks_10","Druckspannung bei 10% Stauchung","Compressive stress due to a compression of 10%","sollecitazione a compressione con schiacciamento del 10%","contrainte de compression pour un tassement de 10 %","Survetugevus 10%-lise kokkusurumise korral"]
["ad_e sog,","e sog,erf.","e suc,nec.","e sog,nec.","e sog,néc.","e nn,erf."]
["ad_eigdef","Eigene Definition","Individual definition","definizione propria","définition propre","Oma määratlus"]
["ad_eindrü","Eindrücken Gewinde","thread press-in",null,null,"Mulje niit"]
["ad_eingabe_dachgeometrie","↗ Eingabe der Dachgeometrie im Blatt Aufdachdämmung","↗ Input of roof geometry in the corresp. worksheet","↗ indicazione della geometria del tetto nella scheda «Isolamento all’estradosso»","↗ saisie de la géométrie de la toiture dans la fiche « Isolation sur toiture »","? Sisestage katuse geomeetria katuse isolatsioonilehel"]
["ad_einwir","Einwirkung","Action",null,null,"Mõju"]
["ad_e-modu","E-Modul","Young´s modulus","modulo di elasticità","module d’élasticité","E-moodul"]
["ad_entlang"," entlang der Sparren"," along the rafters"," lungo i puntoni","le long des chevrons"," mööda sarikaid"]
["ad_entlangF"," entlang der Traglatten"," along the battens"]
["ad_erford","Erforderlicher Schraubenabstand","Required distance between screws","interasse fra le viti richiesto","espacement requis entre les vis","Nõutav kruvide vahekaugus"]
["ad_europe","European Model (EN 1991-1-4)","European Model (EN 1991-1-4)"]
["ad_europe","European Model (EN 1991-1-3)","European Model (EN 1991-1-3)"]
["ad_exwwd","Extremwert Winddruck","Peak wind pressure","valore estremo (pressione del vento)","valeur extrême (surcharge due au vent)","Ekstreemväärtuse tuule rõhk"]
["ad_exwws","Extremwert Windsog","Peak wind suction","valore estremo (suzione del vento)","valeur extrême (succion du vent)","Äärmise väärtusega tuule imemine"]
["ad_fassa","Fassade","Facade","facciata","façade","Fassaad"]
["ad_fassasys","Fassadensystem","Facade system","sistema per facciata","système de façade","Fassaadisüsteem"]
["ad_fassgew","Fassadengewicht","Facade weight","peso della facciata","poids de la façade","Fassaadi kaal"]
["ad_fehll","Fehllänge","Shortlength"]
["ad_festig","Festigkeitsklasse","Strength class","classe di resistenza","classe de résistance","Tugevusklass"]
["ad_firsth","Firsthöhe","Ridge height","altezza del colmo","hauteur du faîtage","Harja kõrgus"]
["ad_formbeiwert_schneelast","Formbeiwert für Schneelasten","Shape coefficient for snow loads","coefficiente di forma per i carichi di neve","coefficient de forme pour les charges de neige","Vormikoefitsient lumekoormuse korral"]
["ad_freie ","freie Länge","free length",null,null,"Vaba pikkus"]
["ad_g1","Gebiete mit niedriger Vegetation wie Gras und einzelne Hindernisse (Bäume, Gebäude) mit Abständen von min. 20-facher Hindernishöhe","Areas with low vegetation such as grass and individual obstacles (trees, buildings) with distances of at least 20 times the height of the obstacle.","Zone con vegetazione bassa come l'erba e singoli ostacoli (alberi, edifici) con distanze di almeno 20 volte l'altezza dell'ostacolo.","Les zones à végétation basse comme l'herbe et les obstacles individuels (arbres, bâtiments) dont la distance est au moins 20 fois la hauteur de l'obstacle.","Madala taimestikuga alad, nagu muru ja üksikud takistused (puud, hooned), mille vahemaa on vähemalt 20 korda suurem kui takistuse kõrgus."]
["ad_g2","Gebiete mit gleichmäßiger Vegetation oder Bebauung oder mit einzelnen Objekten mit Abständen von weniger als der 20-fachen Hindernishöhe (z.B. Dörfer, vorstäditsche Bebauung, Waldgebiete)","Areas with uniform vegetation or buildings or with individual objects with distances of less than 20 times the obstacle height (e.g. villages, suburban development, forest areas)","Aree con vegetazione o edifici uniformi o con singoli oggetti con distanze inferiori a 20 volte l'altezza dell'ostacolo (ad esempio villaggi, sviluppo suburbano, aree boschive)","Les zones avec une végétation ou des bâtiments uniformes ou avec des objets isolés dont la distance est inférieure à 20 fois la hauteur de l'obstacle (par exemple, les villages, le développement suburbain, les zones boisées)","ühtlase taimestikuga või hoonestusega alad või üksikud objektid, mille kaugus on väiksem kui 20 korda takistuse kõrgus (nt külad, linnalähedane hoonestus, metsased alad)."]
["ad_g3","Gebiete, in denen mindestens 15% der Oberfläche mit Gebäuden mit einer mittleren Höhe größer als 15 m bebaut sind","Areas where at least 15% of the surface area is covered with buildings with an average height greater than 15 m","Aree in cui almeno il 15% della superficie è coperto da edifici con un'altezza media superiore a 15 m.","Les zones dont au moins 15 % de la surface est couverte de bâtiments d'une hauteur moyenne supérieure à 15 m.","Piirkonnad, kus vähemalt 15% pindalast on kaetud hoonetega, mille keskmine kõrgus on üle 15 meetri."]
["ad_gelaend","Geländehöhe über dem Meer","Terrain height above sea level",null,null,"Maastiku kõrgus merepinnast"]
["ad_geländefkator","Geländefaktor","Terrain coefficient","fattore di terreno","facteur de terrain","Maastiku tegur"]
["ad_geländekategorie","Geländekategorie","Terrain category","categoria di esposizione","catégorie d’exposition","Maastiku kategooria"]
["ad_geprüft","GEPRÜFT:","APPROVED:","VERIFICATO:","TESTÉ :","TESTITUD:"]
["ad_gewich","Gewicht der Dämmung","Weight of the insulation ","peso del pacchetto isolante","poids de l’isolation","Isolatsiooni kaal"]
["ad_gewind","Gewinde in Latte","Screw thread in lath","filetto nel listello","filetage dans la latte","Lõng lattides"]
["ad_gewind2","Gewinde in UK","Screw thread in subconstruction","filetto nella sottostruttura","filetage dans la sous-construction","Lõng Ühendkuningriigis"]
["ad_grundlagen_nl","auf Grundlage von {0} und {1}","Based on {0} and {1}","in base a {0} e{1}","sur la base de {0} et {1}","{0} ja {1} alusel."]
["ad_höhe ü","Höhe über Grund (Firsthöhe)","Height above ground (ridge height)","altezza rispetto al livello del suolo (altezza del colmo)","hauteur au-dessus du sol (hauteur du faîtage)","Kõrgus maapinnast (harja kõrgus)"]
["ad_horiz.","horiz.proj.","horiz. Proj.","proiezione orizzontale","projection horizontale","horiz.proj."]
["ad_innendruckbeiwerte","Innendruckbeiwerte cpi","Internal pressure coefficient","coefficienti di pressione interna cpi","coefficients de pression intérieure cpi","Siserõhu koefitsiendid cpi"]
["ad_knicke","Knicken der Schraube","screw buckling",null,null,"Kruvi painutamine"]
["ad_konstr_mind","Konstruktiver Mindestabstand der Windsogsichernden Schrauben","Minimum constructive distance between screws against wind suction ","distanza costruttiva minima fra le viti di sicurezza contro la suzione del vento","espacement constructif minimum entre les vis résistantes aux forces de succion du vent","Tuuletõmbe kinnituskruvide konstruktiivne miinimumkaugus"]
["ad_konter","Konterlatten / Grundlatten","Counter-batten",null,null,"Vastulattad / aluslatid"]
["ad_konter_grundl","Konterlatte / Grundlatte (GL)","Counter-batten","controlistello/listello di base","contre-latte/latte principale","Vastulatt / aluslatt (GL)"]
["ad_kopf","Kopfdurchziehen","Srewhead pull-through","rifollamento","Résistance de la tête ","Pea pühkimine"]
["ad_kopfdu","Kopfdurchmesser","Screwhead diameter","diametro della testa","diamètre de la tête","Pea läbimõõt"]
["ad_kopfdu_","Kopfdurchziehparameter","Screwhead pull-through parameter","parametro di rifollamento","Coefficient de résistance de la tête","Pea läbitõmbeparameetrid"]
["ad_informy","informativ","informative"]
["ad_kopfdu2","Kopfdurchziehfestigkeit","Screwhead pull-through strength","resistenza al rifollamento","Résistance de la tête ","Pea läbitõmbetugevus"]
["ad_lakes","Areas at lakes or flat terrain with negligible vegetation and no obstacles"]
["ad_land","Land","Country","paese","pays","Riik"]
["ad_länge ","Länge in Konterlatte","Length in counter-batten","lunghezza nel controlistello","longueur dans la contre-latte","Pikkus vastulattidel"]
["ad_länge2","Länge in Dämmung","Lenght in insulation","lunghezza nell’isolamento","longueur dans l’isolation","Pikkus isolatsioonis"]
["ad_länge3","Länge in Unterkonstr.","Length in subconstruction","lunghezza nella sottostruttura","longueur dans la sous-construction","Pikkus all-str."]
["ad_längen","Längen in der Konstruktion mit harter Dämmung","Lenght in the construction with hard insulation","lunghezza nella sottostruttura con isolamento rigido","longueurs dans la construction avec isolant rigide","Pikkused kõva isolatsiooniga konstruktsioonis"]
["ad_last_text","Lastaufteilung für Bauteile geneigter Dachflächen nach","Distribution of loads for inclinated roof surfaces according to","distribuzione del carico sugli elementi costruttivi di tetti inclinati secondo","répartition de la charge pour les éléments de toiture inclinée selon","Kaldkatuse pindade komponentide koormusjaotus vastavalt"]
["ad_lastan","LASTANNAHME SCHNEE","SNOW LOAD ASSUMPTION","CARICO STRUTTURALE (NEVE)","CALCUL DES CHARGES (NEIGE)","KOORMUSE VASTUVÕTMINE LUMI"]
["ad_lastann_wind","LASTANNAHME WIND","WIND LOAD ASSUMPTION","CARICO STRUTTURALE (VENTO)","CALCUL DES CHARGES (VENT)","KOORMUSE VASTUVÕTMISE TUUL"]
["ad_lastannahmen","Lastannahmen für Wind und Schnee","Wind and Snow loads","carichi strutturali relativi a vento e neve","calcul des charges pour le vent et la neige","Tuule ja lume koormuse eeldused"]
["ad_lasten1","Lasten parallel zur Dachfläche (Dachschub zur Dimensionierung der geneigten Schrauben)","Loads parallel to the roof surface (roof shear forces for dimensioning the inclined screws)","carichi paralleli alla superficie del tetto (forza di taglio agente sul tetto per il dimensionamento delle viti inclinate)","charges parallèles à la surface de la toiture (forces de cisaillement sur la toiture pour le dimensionnement des vis inclinées)","Katuse pinnaga paralleelsed koormused (katuse nihkejõud kaldus kruvide dimensioneerimiseks)"]
["ad_lasten2","Lasten normal zur Dachfläche (Windsog zur Dimensionierung der rechtwinkelig zur Dachfläche angeordneten Zugschrauben)","Loads normal to the roof surface (wind suction for dimensioning the screws with tension force arranged with an right angle to the roof surface)","carichi perpendicolari alla superficie del tetto (suzione del vento per il dimensionamento delle viti di trazione fissate ad angolo retto rispetto alla superficie del tetto)","charges perpendiculaires à la surface de la toiture (forces de succion du vent pour le dimensionnement des vis de traction placées perpendiculairement à la surface de la toiture)","Katusekatte pinna suhtes normaalsed koormused (tuuletõmme katusekatte pinna suhtes täisnurga all paigutatud pingutuspoltide dimensioneerimiseks)."]
["ad_lasten3","Lasten normal zur Dachfläche (Druck zur Dimensionierung von Konterlattung und Dämmung)","Loads normal to the surface (Pressure for dimensioning counter-battening and insulation)","carichi perpendicolari alla superficie del tetto (pressione per il dimensionamento della controlistellatura e dell’isolamento)","charges perpendiculaires à la surface de la toiture (pression pour le dimensionnement du contre-lattage et de l’isolation)","Katusekatuse pinna suhtes normaalsed koormused (surve vastuliistude ja isolatsiooni dimensioneerimiseks)"]
["ad_length","Längen von Schraube {0} in der Konstruktion mit weicher Dämmung","Lengths of screw {0} in the construction with soft insulation",null,null,"Kruvi pikkus {0} pehme isolatsiooniga konstruktsioonis"]
["ad_locationInfo","Derzeit sind die Standortdaten auf AT und DE eingeschränkt. Sie können Schnee- und Windlasten direkt im nächsten Eingabeformular definieren.","Currently, location data is limited to AT and DE. You can define snow and wind loads directly in the next input form."]
["ad_maßgeb","maßgebende Kombination - Lasten vertikal bezogen auf die schräge Länge","Leading combination - loads vertical based on the oblique length","combinazione di riferimento – carichi verticali riferiti alla lunghezza inclinata","combinaison de référence – charges verticales et longueur du ou des pans de toiture","otsustav kombinatsioon - koormused on vertikaalselt seotud kallakpikkusega"]
["ad_maßgeb1","maßgebende Kombination - Lasten normal zur Dachfläche (Windsog)","Leading combination - loads normal to the roof surface (wind suction)","combinazione di riferimento – carichi perpendicolari alla superficie del tetto (suzione del vento)","combinaison de référence – charges perpendiculaires à la surface de la toiture (forces de succion du vent)","Asjakohane kombinatsioon - koormused normaalselt katusepinnale (tuule imemine)"]
["ad_maxlen","Maximallänge in UK","max length in subconstr."]
["ad_mineinslng","Mindesteinschraublänge","minimum screw-in length"]
["ad_minlen","Mindestlänge in UK","min length in subconstr."]
["ad_moment","Momente","Moments",null,null,"Hetked"]
["ad_nachwe","Nachweise und Auslastungen","Design and utilization","verifiche e carichi effettivi","vérifications et charges effectives","Tõendid ja suutlikkuse kasutamine"]
["ad_nachweis","NACHWEISFÜHRUNG","DESIGN CALCULATION","PROCEDIMENTO DI VERIFICA","CALCULS ET VÉRIFICATIONS","KONTROLLIMINE"]
["ad_nenndu","Nenndurchmesser","Nominal diameter","diametro nominale","diamètre nominal","Nominaalne läbimõõt"]
["ad_normal","normal","normal","Normale","Normal","tavaline"]
["ad_normal2"," normal"," normal"," normale","normal"," tavaline"]
["ad_nutzla","Nutzlast ","Live load","carico utile ","charge utile","Kaskoormus"]
["ad_nutzlastkategorie","Nutzlastkategorie H: Dächer lt. EN 1991-1-1","Live load category H: roofs acc. to EN 1991-1-1","classe d’impiego H: tetti ai sensi della norma EN 1991-1-1","classe d’utilisation H : toitures selon EN 1991-1-1","H-kategooria: katused vastavalt standardile EN 1991-1-1."]
["ad_nutzun","Nutzungsklasse","Service class","classe d’utilizzo","classe d’utilisation","Kasutusklass"]
["ad_optimierng","Optimierung","Optimise"]
["ad_pcs","STK","pcs.",null,null,"STK"]
["ad_pcspm","STK/m","pcs./m",null,null,"STK/m"]
["ad_pcspsm","STK/m²","pcs./m²",null,null,"STK/m²"]
["ad_pcsRafter","STK/Sparren","pcs/rafter",null,null,"STK/rafter"]
["ad_pcsRafter_2","STK/Traglatten","pcs/batten"]
["ad_pressu","Pressung der Dämmung","Compression of the insulation","compressione esercitata dal pacchetto isolante","pression de l’isolation","Isolatsiooni vajutamine"]
["ad_produk","Produkt","Product","prodotto","produit","Toode"]
["ad_pultdach","Pultdach / Flach","single pitched / flat","tetto ad una falda","toiture à une pente","Varikatusega katus"]
["ad_rohdic","Rohdichte","Bulk Density","massa volumica","masse volumique","Toortihedus"]
["ad_satteldach","Satteldach","double pitched","tetto a due falde","toiture à deux versants","Katusekatus"]
["ad_schalu","Schalung","Formwork","tavolato","voligeage","Sulgemine"]
["ad_schnee","Schneezone","Snow zone",null,null,"Lumevöönd"]
["ad_schnee_abrutschen","Schnee vom Abrutschen behindert","Snow sliding is prevented","Si previene lo scivolamento della neve dal tetto.","La neige est retenue sur la toiture.","Lumi takistab alla libisemist"]
["ad_schneelast","Schneelast","Snow load","carico di neve","charge de neige","Lumekoormus"]
["ad_schneelast_boden","Schneelast auf dem Boden","Ground snow load","carico di neve a terra","charge de neige au sol","Lumekoormus maapinnale"]
["ad_schneelast_dächer","Schneelast auf Dächern","Roof snow load","carico di neve sui tetti","charge de neige sur les toits","Lumekoormus katustel"]
["ad_schräg","schräg","oblique","inclinato","En biais","kallutatud"]
["ad_schräge1","(schräge Länge beider Sparren)","(oblique length from both rafters)","(lunghezza inclinata dei due puntoni)","(longueur des deux chevrons)","(mõlema sarika kallutatud pikkus)"]
["ad_schräge2","(schräge Länge eines Sparrens)","(oblique length from one rafter)","(lunghezza inclinata di un puntone)","(longueur d’un chevron)","(parve diagonaalpikkus)"]
["ad_schrau","Schraubenabstand","Screw distance","interasse fra le viti","espacement entre les vis","Kruvide vahekaugus"]
["ad_schrau_","Schraubentragfähigkeit für Dachlasten","Screw load bearing capacity for roof loads","capacità di carico delle viti per i carichi agenti sul tetto","capacité de charge des vis pour les charges supportées par le toit","Kruvi kandevõime katuse koormuste puhul"]
["ad_schrau_abm","Schraubenabmessungen","Screw dimensions","dimensioni delle viti","dimensions des vis","Kruvi mõõtmed"]
["ad_schrau_n","Schraubenneigung","Screw inclination","angolo d’inserimento delle viti","inclinaison des vis","Kruvi kalle"]
["ad_schrau_schub","Schrauben Dachschub","Screws roof shear","viti (forza di taglio agente sul tetto)","vis (forces de cisaillement sur toiture)","Katusekruvid"]
["ad_schrau_sog","Schrauben Windsog","Screws wind suction","viti (suzione del vento)","vis (succion du vent)","Kruvid Tuule imemine"]
["ad_schrau_sog2","Schraubenstückzahl Windsog","Number of screws wind suction","numero di viti (suzione del vento)","nombre de vis (succion du vent)","Kruvide arv Tuule imemine"]
["ad_schrau2","Schraubentyp","Screw type","tipo di vite","type de vis","Kruvi tüüp"]
["ad_schrau3","Schrauben - Gesamtstückzahl","Total number of screws","viti – numero totale di viti","nombre total de vis","Kruvid - üldkogus"]
["ad_schrau4","Schraubenstückzahl","Nubmer of screws","numero di viti","nombre de vis","Kruvide arv"]
["ad_schrau5","Schraubenabstände","Screw distances","interasse fra le viti","espacements entre les vis","Kruvide vahekaugus"]
["ad_schrau6","Schraubenabst. hor.","Screw distance hor.","interasse fra le viti (piano orizzontale)","espacements entre les vis (horizontal)","Kruvide vahekaugus hor."]
["ad_schraube","Schraube","Screw","vite","vis","Kruvi"]
["ad_schraube_tragf","Schraubentragfähigkeit ","Screw load bearing capacity","capacità di carico delle viti ","capacité de charge des vis","Poldi kandevõime"]
["ad_schraube1","Schraube 1","Screw 1","vite 1","vis 1","Kruvi 1"]
["ad_schraube2","Schraube 2","Screw 2","vite 2","vis 2","Kruvi 2"]
["ad_schraubenabstand1","Schraubenabstand Bereich H, I","Screw distance area H, I","interasse fra le viti (aree H, I)","espacement entre les vis (zone de toit H, I)","Kruvide vahekaugus Vahemik H, I"]
["ad_schraubenabstand2","Schraubenabstand Bereich G","Screw distance area G","interasse fra le viti (area G)","espacement entre les vis (zone de toit G)","Kruvide vahekaugus Vahemik G"]
["ad_schraubenabstand3","Schraubenabstand Bereich F","Screw distance area F","interasse fra le viti (area F)","espacement entre les vis (zone de toit F)","Kruvide vahekaugus Vahemik F"]
["ad_schraubenabstand4","Schraubenabstand Bereich J","Screw distance area J","interasse fra le viti (area J)","espacement entre les vis (zone de toit J)","Kruvide vahekaugus Vahemik J"]
["ad_schraudim","Schraubendimension","Screw dimension","dimensioni delle viti","dimension des vis","Kruvi mõõtmed"]
["ad_schraun","Schraube {0}","Screw {0}",null,null,"Kruvi {0}"]
["ad_scorlen","Schraube 2 hat die richtige Länge.","Screw 2 has the correct length",null,null,"Kruvi 2 on õige pikkusega."]
["ad_seacoast","Sea or coastal area exposed to the open sea"]
["ad_shape","Form","Shape"]
["ad_sog","Sog","Suction","suzione","forces de succion du vent","Imemine"]
["ad_sparre","Sparrenlänge ","Rafter length","lunghezza di falda ","longueur des chevrons","Sparri pikkus"]
["ad_sparre2","Gesamtlänge Sparren","Total rafter length","lunghezza totale delle falde","longueur totale des chevrons","Parve kogupikkus"]
["ad_sparren_","Sparren (zur Kontrolle der Schraubenabmessungen)","Rafter dimensions (to check screw dim.)","puntone (per controllare le dimensioni delle viti)","chevrons (pour le contrôle des dimensions des vis)","Sparred (kruvide mõõtmete kontrollimiseks)"]
["ad_sparren_2","Traglatte (zur Kontrolle der Schraubenabmessungen)","Batten dimensions (to check screw dim.)"]
["ad_sparrenabstand","Sparrenabstand","Rafter spacing","distanza fra i puntoni","espacement entre les chevrons","Sparraste vahekaugus"]
["ad_sparrenlänge","Sparrenlänge","Rafter length","lunghezza di falda","longueur des chevrons","Sparri pikkus"]
["ad_spigedru","Spitzengeschwindigkeitsdruck","Peak velocity pressure","pressione dinamica di picco","pression dynamique de pointe","Rõhu kiiruse rõhk"]
["ad_stadt","Stadt","City","città","ville","Linn"]
["ad_standort","Standort","Site location","ubicazione","emplacement","Asukoht"]
["ad_standort1"," Standortangabe im Blatt Standort","Input of site location in the corresp. worksheet",null,"indication de l’emplacement dans la feuille « Emplacement »"," Asukoha teave asukoha lehel"]
["ad_standort1","↘ Standortangabe im Blatt Standort","↗ Input of site location in the corresp. worksheet","↘ indicazione del luogo nella scheda «Ubicazione»","↘ indication de l’emplacement dans la feuille « Emplacement »","? Asukoha andmed asukoha lehel"]
["ad_stk","Stk. Schrauben insgesamt","Number of screws","viti totali","nombre total de vis","Kruvide koguarv"]
["ad_system","System","System",null,null,"Süsteem"]
["ad_threadstart","Gewindeanfang","thread start"]
["ad_toolong1","Die Schrauben zur Dachschubsicherung sind zu lange!","The screws for securing the roof slide are too long!",null,null,"Kruvid katuse liuguri kinnitamiseks on liiga pikad!"]
["ad_toolong2","Die Schrauben zur Windsogsicherung sind zu lang","The screws for securing against wind suction are too long",null,null,"Kruvid tuuletõmbe kinnitamiseks on liiga pikad"]
["ad_tooshort1","Die Schrauben zur Dachschubsicherung sind um {0} mm zu kurz!","The roof shear protection screws are {0} mm too short!",null,null,"Katuse liuguri kinnitamiseks mõeldud kruvid on {0} mm liiga lühikesed!"]
["ad_tooshort2","Die Schrauben zur Windsogsicherung sind um {0} mm zu kurz!","The screws for securing against wind suction are {0} mm too short!",null,null,"Kruvid tuuletõmbe kinnitamiseks on {0} mm liiga lühikesed!"]
["ad_traufe","Traufenlänge","Eaves length","lunghezza delle gronde","Longueur Chénau ","Räästade pikkus"]
["ad_traufl","Trauflänge","Eaves length","lunghezza delle gronde","Longueur Chénau ","Räästade pikkus"]
["ad_type_C-FH","Teilgewinde, Unterlegscheibe-Senkkopf","partial thread, washer-countersunk head","filettatura parziale, testa a rondella svasata",null,"osakeere, lapik-peitpea","częściowy gwint, łeb podkładkowo-stożkowy","delgängad, försänkt brickhuvud","delgjenger, skive-forsenket hode","osittainen kierre, aluslevy-vastakangaspää","nepilna vītne, kombinēta moztāžas galva","dalinis sriegis, plati-įgilinta galvutė"]
["ad_type_C-FT","Vollgewinde, Senkkopf","fullthread, countersunk head","filettatura intera, testa svasata",null,"täiskeere, peitpea","pełny gwint, łeb stożkowy","helgängad, försänkt huvud","fullgjenget, forsenket hode","täyskierre, upotettu pää","pilna vītne, gremdgalva ","pilnas sriegis, įgilinta galvutė"]
["ad_type_C-PT","Teilgewinde, Senkkopf","partial thread, countersunk head","filettatura parziale, testa svasata",null,"osakeere, peitpea","częściowy gwint, łeb stożkowy","delgängad, försänkt huvud","delgjenger, forsenket hode","osittainen kierre, upotettu pää","nepilna vītne, gremdgalva","dalinis sriegis, įgilinta galvutė"]
["ad_type_CY-DT","Doppelgewinde, Zylinderkopf (thermisch)","double thread, cylinder head (thermal)","doppio filetto, testa di cilindro (termico)",null,"topeltkeere, silinder pea (thermal)","podwójny gwint, łeb cylindryczny (termiczny)","dubbelgänga, cylindriskt huvud (termisk)","dobbel gjenger, sylinderhode (termisk)","kaksinkertainen kierre, sylinterikansi (lämpö)","dubultā vītne, cilindriska galva","dvigubas sriegis, cilindro galvutė (terminė)"]
["ad_type_CY-FT","Vollgewinde, Zylinderkopf","fullthread, cylinder head","filettatura intera, testa cilindrica",null,"täiskeere, silinder pea","pełny gwint, łeb cylindryczny","helgängad, cylindriskt huvud","helgjenger, sylinderhode","täyskierre, sylinterikansi","pilna vītne, cilindriska galva","pilnas sriegis, cilindro galvutė"]
["ad_type_H-FT","Vollgewinde, Sechskant-Kombikopfanker","fullthread, hex-kombi head anchor","täiskeere, kuuskant-torxpea ankur",null,"täiskeere, kuuskant-torxpea ankur","gwint pełny, łeb sześciokątny-kombi kotwica","helgängad, hex-kombi huvudankare","fullgjenget, hex-kombi hodeanker","täyskierre, hex-kombi pääankkuri","pilna vītne, hex-kombi galva","pilnas sriegis, šešiabriaunis inkaras su galvute"]
["ad_type_H-PT","Teilgewinde, Sechskant-Kombikopf","partial thread, hex-kombi head","filettatura parziale, testa esagonale-kombi",null,"osakeere, kuukant-torxpea","częściowy gwint, łeb sześciokątny-kombi","delgängad, hex-kombi huvud","delgjenger, hex-kombi hode","osakierre, hex-kombi pää","nepilna vītne, hex- kombi galva","dalinis sriegis, hex-kombi galvutė"]
["ad_type_H-PT-TC","Holz-Beton-Verbund-System","timber-concrete composite-system","sistema composito legno-calcestruzzo",null,"puit-betoon komposiit-süsteem","kompozytowy system drewno-beton","trä-betong komposit-system","tømmer-betong kompositt-system","puu-betoni-komposiittijärjestelmä","koks-betons kompozītsistēma","medienos-betono kompozito sistema"]
["ad_type_W-LF","Teilgewinde, Scheibenkopf","partial thread, washer head","filettatura parziale, testa a rondella",null,"osakeere, lapik pea","częściowy gwint, łeb podkładkowy","delgängad, brickhuvud","delgjenger, skivehode","osittainen kierre, aluslevy","nepilna vītne, montāžas galva","dalinis sriegis, plati galvutė"]
["ad_überp","Überprüfung der Geometrie","Check of the geometry","verifica della geometria","vérification de la géométrie","Geomeetria kontrollimine"]
["ad_unendl","Unendlicher Durchlaufträger über zwei Felder","Infinite continuous beam over two fields",null,null,"Lõpmatu pidev kiir üle kahe välja"]
["ad_unterkonstr","Unterkonstruktion","sub construction","sottostruttura","sous-construction","Alusstruktuur"]
["ad_varian1","Variante 1 - Weiche Dämmung/ Abwechselnde Neigung der Schrauben","Method 1 - Soft Insulation / changing direction of inclination of the screws","Variante 1 – isolante flessibile | angoli d’inserimento delle viti a direzioni alterne","variante 1 – isolant souple | inclinaison alternée des vis","Variant 1 - Pehme isolatsioon / kruvide vahelduv kalle"]
["ad_varian2","Variante 2 - Druckfeste Dämmung/ nur eine Neigungsrichtung der Schrauben","Method 2 - Hard Insulation / one direction of inclination of the screws","Variante 2 – isolante rigido | angolo d’inserimento delle viti a direzione unica","variante 2 – isolant rigide | même inclinaison pour toutes les vis","Variant 2 - Survekindel isolatsioon/ ainult üks kruvide kallutussuund."]
["ad_varian3","nur eine Neigungsrichtung der Schrauben","one direction of inclination of the screws","angolo d’inserimento delle viti a direzione unica","même inclinaison pour toutes les vis","Ainult üks kruvide kallutussuund"]
["ad_varian4","abwechselnde Neigung der Schrauben","changing direction of inclination of the screws","angoli d’inserimento delle viti a direzioni alterne","inclinaison alternée des vis","Kruvide vahelduv kalle"]
["ad_verbindmittel","Verbindungsmittel","Connection","unioni","organes d’assemblage","Lanyard"]
["ad_wallen","Wandlänge","Wall length"]
["ad_wand","Wand","Wall","parete","mur","Seina"]
["ad_wandf","Wandfläche","Wall area","superficie della parete","surface du mur","Seinapind"]
["ad_wandh","Wandhöhe","Wall height","altezza della parete","hauteur du mur","Seina kõrgus"]
["ad_wandl","Wandlänge","Wall length","lunghezza della parete","longueur du mur","Seina pikkus"]
["ad_wenn1","Die Schrauben haben die richtige Länge.","The screws have the correct length.","Le viti hanno la lunghezza giusta.","Les vis ont la longueur requise.","Kruvid on õige pikkusega."]
["ad_wichte","Wichte der Dämmung","Weight density","peso specifico dell’isolante","poids spécifique de l’isolant","Isolatsiooni kaal"]
["ad_winddruck","Winddruck","Wind pressure","pressione del vento","surcharge due au vent (pression du vent)","Tuule surve"]
["ad_winddruckw","Winddruck w D,k","Wind pressure w Pr,k","pressione del vento w Pr,k","surcharge due au vent (pression du vent) w Pr,k","Tuule surve w Pr,k"]
["ad_windru","Winddruck","Wind pressure","pressione del vento","surcharge due au vent (pression du vent)","Tuule surve"]
["ad_windso","Windsogsicherung","Wind suction securing","sicurezza contro la suzione del vento","sécurité contre les forces de succion du vent","Tuule imemiskaitse"]
["ad_windso2","Windsogsicherung über Schrauben rechtwinkelig zur Dachfläche","Wind suction securing through screws rectangular to the roof surface","sicurezza contro la suzione del vento tramite viti inserite ad angolo retto rispetto alla superficie del tetto","sécurité contre les forces de succion du vent à l’aide de vis perpendiculaires à la surface de la toiture","Tuule imemiskaitse katusepinna suhtes risti asetsevate kruvide abil"]
["ad_windsog","Windsog","Wind suction","suzione del vento","succion du vent","Tuule imemine"]
["ad_windsog_w","Windsog w S,k","Wind suction w S,k","suzione del vento w S,k","succion du vent w S,k","Tuule imemine w S,k"]
["ad_windsogspitzenvordach","Windsogspitzen im Vordachbereich werden von den Sparren aufgenommen und betreffen nicht die Konterlatten / Grundlatten.","Peak wind suction on porch roofs act on rafters and not on counter-battens","i picchi di suzione del vento nella zona dello sporto vengono assorbiti dai puntoni e non riguardano i controlistelli/listelli di base.","Dans la zone de l’avant-toit, les forces de succion extrêmes sont absorbées par les chevrons et n’ont pas d’incidence sur les contre-lattes/lattes principales.","Tuule tõmbetuule piigid varikatuse piirkonnas neelduvad sarikate poolt ja ei mõjuta vastulattide / aluslattide tööd."]
["ad_windss12","Windsogsicherung durch die Schrauben 1 und 2","Wind suction protection with screws 1 and 2",null,null,"Tuule imemiskaitse kruvidega 1 ja 2"]
["ad_wsn_01","Start","Start"]
["ad_wsn_02","Menü","Menu"]
["ad_wsn_03","Standort","Location"]
["ad_wsn_04","Aufdachdämmung","TopRoofInsulation"]
["ad_wsn_05","Zusammenf. weich","summary soft"]
["ad_wsn_06","Zusammenf. hart","summary hard"]
["ad_wsn_07","Rechnung weich","calc soft"]
["ad_wsn_08","Rechnung hart","calc hard"]
["ad_wsn_11","Berechnung_Weiche Dämmung_2","calc soft_2"]
["ad_wsn_12","Berechnung_Weiche Dä_2_Windsog","calc soft_suction_2"]
["ad_zukurz","Die Schrauben zur Dachschubsicherung sind um {0} mm zu kurz!","The roof shear securing screws are {0} mm to short!","Le viti di sicurezza contro la forza di taglio agente sul tetto sono di ………… mm troppo corte!","Les vis de sécurité contre les forces de cisaillement sur toiture sont {0} mm trop courtes !","Katuse liuguri kinnitamiseks mõeldud kruvid on {0} mm liiga lühikesed!"]
["ad_zukurz2","Die Schrauben zur Windsogsicherung sind um {0} mm zu kurz!","The screws against wind suction are {0} mm to short!","Le viti di sicurezza contro la forza di taglio agente sul tetto sono di ………… mm troppo lunghe!","Les vis de sécurité contre les forces de succion du vent sont {0} mm trop courtes !","Kruvid tuuletõmbe kinnitamiseks on {0} mm liiga lühikesed!"]
["ad_zulang","Die Schrauben zur Dachschubsicherung sind um {0} mm zu lang!","The roof shear securing screws are {0} mm to long!","Le viti di sicurezza contro la forza di suzione del vento sono di ………… mm troppo corte!","Les vis de sécurité contre les forces de cisaillement sur toiture sont {0} mm trop longues !","Katuse liuguri kinnitamiseks mõeldud kruvid on {0} mm liiga pikad!"]
["ad_zulang2","Die Schrauben zur Windsogsicherung sind um {0} mm zu lang!","The screws against wind suction are {0} mm to long!","Le viti di sicurezza contro la forza di suzione del vento sono di ………… mm troppo lunghe!","Les vis de sécurité contre les forces de succion du vent sont {0} mm trop longues !","Kruvid tuuletõmbe kinnitamiseks on {0} mm liiga pikad!"]
["ad_zuläss","zulässige Pressung","Allowed compression","compressione ammissibile","pression autorisée","Lubatud rõhk"]
["ad_zusamm","ZUSAMMENFASSUNG:","SUMMARY:","SINTESI:","RÉCAPITULATIF :","KOKKUVÕTE:"]
["ad_zusamm_weich","Zusammenfassung für Systeme mit weicher Dämmung","Summary for constructions with soft insulation","sintesi per sistemi con isolante flessibile","récapitulatif pour les systèmes à isolant souple","Kokkuvõte pehme isolatsiooniga süsteemide puhul"]
["loc_asDefined","as defined in National Annex"]
["loc_meanwind","Mean wind"]
["loc_qbdesc","Basic wind pressure"]
["loc_roughlen","Roughness Length"]
["loc_terrfac","Terrain Factor"]
["loc_topof","Topography factor"]
["loc_turbfac","Turbulence factor"]
["loc_turbint","Turbulence intensity"]
["loc_zmin","Minimum Height"]
["lst_baude sf","Bauder PIR SF","Bauder PIR SF","Bauder PIR SF","Bauder PIR SF","Bauder PIR SF"]
["lst_baudelus","Bauder PIR Plus","Bauder PIR Plus","Bauder PIR Plus","Bauder PIR Plus","Bauder PIR Plus"]
["lst_biber","Biberdoppeldeckung","Beaver double roofing","Tetto doppio Beaver","Double toit en castor","Beaver topeltkate"]
["lst_braasort","Braas Clima Comfort","Braas Clima Comfort","Braas Clima Comfort","Braas Clima Comfort","Braas Clima Comfort"]
["lst_dachs","Steine","tiles","Tegole","Tuiles de toit","Katusekivid"]
["lst_dachz","Ziegel","tiles","Tegole","Tuiles de toit","Katusekivid"]
["lst_freie","freie Eingabe","free input","ingresso libero","entrée libre","Vaba sisend"]
["lst_freieabe","freie Eingabe","free input","ingresso libero","entrée libre","Vaba sisend"]
["lst_gutexerm","Gutex Ultratherm","Gutex Ultratherm","Gutex Ultratherm","Gutex Ultratherm","Gutex Ultratherm"]
["lst_holzwung","Holzweichfaserdämmung","Soft wood fibre insulation","Isolamento morbido in fibra di legno","Isolation en fibre de bois tendre","Pehme puidukiudude isolatsioon"]
["lst_JA","JA","YES","SÌ","OUI","JAH"]
["lst_klöbeerm","Klöber PermoTherm","Klöber PermoTherm","Klöber PermoTherm","Klöber PermoTherm","Klöber PermoTherm"]
["lst_metal","Blech","Metal","metallo","métallique","Metallkatus"]
["lst_msgtext","Nicht alle Auswahleingaben konnten automatisch auf die gewünschte Sprache umgestellt werden. Bitte überprüfen Sie alle Eingaben damit die Berechnungen durchgeführt werden können.","Not all selection entries could be automatically changed to the desired language. Please check all entries so that the calculations can be carried out.","Non tutte le voci di selezione potrebbero essere cambiate automaticamente nella lingua desiderata. Si prega di controllare tutte le voci in modo che i calcoli possano essere eseguiti.","Toutes les entrées de sélection n'ont pas pu être automatiquement modifiées dans la langue souhaitée. Veuillez vérifier toutes les entrées afin que les calculs puissent être effectués.","Kõiki valikukirjeid ei saa automaatselt soovitud keelele muuta. Palun kontrollige kõiki kandeid, et arvutused saaksid toimuda."]
["lst_msgtitle","Automatische Sprachumstellung nicht möglich","Automatic language change is not possible","Il cambio automatico della lingua non è possibile","Le changement automatique de langue n'est pas possible","Automaatne keelevahetus ei ole võimalik"]
["lst_NEIN","NEIN","NO","NO","NON","EI"]
["lst_pavatair","Pavatherm isolair","Pavatherm isolair","Pavatherm isolair","Pavatherm isolair","Pavatherm isolair"]
["lst_pavatlus","Pavatherm plus","Pavatherm plus","Pavatherm plus","Pavatherm plus","Pavatherm plus"]
["lst_purenlus","puren PLUS","puren PLUS","puren PLUS","puren PLUS","puren PLUS"]
["lst_rockwert","Rockwool Masterrock NB Kaschiert","Rockwool Masterrock NB laminated","Rockwool Masterrock NB laminato","Laine de roche Masterrock NB laminée","Rockwool Masterrock NB Laminaat"]
["lst_schie","Schiefer","Slate","Ardesia","Slate","Kiltkivi"]
["lst_schin","Schindel","Shingles","scandole","bardeaux","Katusekivi"]
["lst_sft_freieabe","freie Eingabe","free input","ingresso libero","entrée libre","Vaba sisend"]
["lst_sft_gutexafe","Gutex Theromsafe","Gutex Theromsafe","Gutex Theromsafe","Gutex Theromsafe","Gutex Theromsafe"]
["lst_sft_steicerm","Steico therm","Steico therm","Termico Steico","Steico therm","Steico therm"]
["lst_sft_weichung","Weiche Dämmung","Soft insulation","Isolamento morbido","Isolation souple","Pehme isolatsioon"]
["lst_sp_1","Kopf Versenkt","Head sunken","Testa infossata","Tête enfoncée","Pea uppunud"]
["lst_sp_2","Kopf nicht Versenkt","Head not countersunk","Testa non svasata","Tête non enfoncée","Pea ei ole uppunud"]
["lst_sp_3","Nur bis Gewindestart eingeschraubt","Only screwed in up to threaded start","Avvitato solo fino all'inizio filettato","A visser uniquement jusqu'au début du filetage","Ainult keeratud kuni keermestatud alguseni"]
["lst_sp_4","Sonstige","Other","Altro","Autre","Muud"]
["lst_sp_tit","Kopfposition","Head position","Posizione della testa","Position de la tête","Pea asend"]
["lst_steicdry","Steico universal dry","Steico universal dry","Steico universale asciutto","Steico universal dry","Steico universaalne kuiv"]
["lst_steicdry14","Steico universal dry","Steico universal dry","Steico universale asciutto","Steico universal dry","Steico universaalne kuiv"]
["lst_steicdry15","Steico spezial dry","Steico special dry","Steico speciale secco","Steico special dry","Steico special dry"]
["lst_steicerm","Steico therm","Steico therm","Termico Steico","Steico therm","Steico therm"]
["lst_steicsal","Steico universal","Steico universal","Steico universale","Steico universal","Steico universaalne"]
["tc_ gefor"," gefordert."," as required."," richiesto."," requis."," vajalik.",null,null,null,null,null,null,"požadováno."]
["tc_ gelte"," gelten folgende Grenzwerte: (lt. ON NA.AT)"," the following limits apply:"," valgono i seguenti valori limite:"," les valeurs seuils suivantes s'appliquent :"," kehtivad järgmised piirväärtused: (vastavalt ON NA.AT)",null,null,null,null,null,null," Následující limity platí: (lt ON NA.AT.)"]
["tc_ nicht"," nicht! Die Betonplattendicke h 1 sowie der Achsabstand d 1 (bzw. die Betondeckung c) müssen erhöht werden bzw. sind genauere Untersuchungen am Gesamtquerschnitt notwendig."," not! The slab thickness h 1 and the axial distance d 1 (resp. the covering c) have to be increased. More detailed analsysis on the full cross-section may be required."," no! Lo spessore della soletta in cemento h 1 come pure l'interasse d 1 (o il rivestimento in cemento c) devono essere incrementati o sono necessarie verifiche più precise sulla sezione trasversale complessiva."," non ! L'épaisseur de la dalle en béton h 1 ainsi que l'entraxe d 1 (ou la couverture de béton c) doivent être augmentés ou des examens plus précis de l'ensemble de la coupe transversale sont nécessaires."," mitte! Betoonplaadi paksust h 1 ja keskkoha kaugust d 1 (või betoonkatet c) tuleb suurendada või on vaja üksikasjalikumaid uuringuid kogu ristlõike kohta.",null,null,null,null,null,null," ne! Betonové desky tloušťky h 1 a osová vzdálenost d 1 (nebo betonové krytí c) musí být zvýšeny, popř. jsou nutné  podrobnější studie na celém řezu."]
["tc_ nicht2_"," nicht! Der Achsabstand d 1 (bzw. die Betondeckung c) muss erhöht werden bzw. sind genauere Untersuchungen am Gesamtquerschnitt notwendig."," not! The axial distance d 1 (resp. the covering c) have to be increased. More detailed analsysis on the full cross-section may be required."," no! L'interasse d 1 (o il rivestimento in cemento c) deve essere incrementato o sono necessarie verifiche più precise sulla sezione trasversale complessiva."," non ! L'entraxe d 1 (ou la couverture de béton c) doit être augmenté ou des examens plus précis de l'ensemble de la coupe transversale sont nécessaires."," mitte! Keskkaugus d 1 (või betoonkate c) tuleb suurendada või on vaja täpsemaid uuringuid kogu ristlõike kohta.",null,null,null,null,null,null," ne! Osová vzdálenost d 1 (nebo betonové krytí c)  musí být zvýšena, popř. jsou nutné  podrobnější studie na celém řezu."]
["tc_ schmi"," {0} übernimmt keinerlei Haftung für die Vollständigkeit und Richtigkeit der vorliegenden Berechnung."," {0} does not hold any warranty for completeness or correctness of these calculations."," La ditta  {0} non risponde della completezza e della correttezza del presente calcolo. "," {0} n'assume aucune responsabilité quant à l'intégralité et à l'exactitude du présent calcul."," {0} ei võta vastutust selle arvutuse täielikkuse ja täpsuse eest.",null,null,null,null,null,null," {0} nepřebírá žádnou odpovědnost za úplnost a správnost tohoto výpočtu."]
["tc_ verbi"," Verbindungsmittel nebeneinander)"," connections next to each other)."," Elementi di giunzione uno accanto all'altro"," Dispositifs d'assemblage l'un à côté de l'autre)"," kinnitusdetailid üksteise kõrval)",null,null,null,null,null,null," Spojovací prostředky vedle sebe"]
["tc_(e·i) ","(E·I) ℓ","(E·I) ℓ","(E·I) ℓ","(E·I) ℓ","(E-I) â",null,null,null,null,null,null,"(E · I) ℓ"]
["tc_(e·i)1 _","(E·I) b","(E·I) b","(E·I) b","(E·I) b","(E-I) b",null,null,null,null,null,null,"(E · I) b"]
["tc_(ei)ef","(EI)ef,u","(EI)ef,u","(EI)ef,u","(EI)ef,u","(EI)ef,u",null,null,null,null,null,null,"(EI) ef, u"]
["tc_(ei)ef1_","(EI)ef","(EI)ef","(EI)ef","(EI)ef","(EI)ef",null,null,null,null,null,null,"(EI) ef"]
["tc_(mitte","(Mittelwert aus Tabelle 2.1 ÖNORM EN 1995-1-2)","(Mean value according to table 2.1 in EN 1995-1-2)","(Valore medio preso dalla tabella 2.1 ÖNORM EN 1995-1-2)","(valeur moyenne du tableau 2.1 ÖNORM EN 1995-1-2)","(keskmine väärtus tabelist 2.1 ÖNORM EN 1995-1-2)",null,null,null,null,null,null,"(Střední hodnota z tabulky 2.1  EN 1995-1-2)"]
["tc_(n ed ","(N Ed > 0 bei Druck)","(N Ed > 0 in compression)","N Ed > 0 con pressione)","(N Ed > 0 si une pression est présente)","(N Ed > 0 rõhu all)",null,null,null,null,null,null,"(N Ed> 0 při tisku)"]
["tc_(schne","(Schneider: Bautabellen für Bauingenieure, 20. Auflage, 5.48, Punkt 3.5.4)","(Schneider: Bautabellen für Bauingenieure, 20. Edition, 5.48, 3.5.4)","(Schneider : Bautabellen für Bauingenieure, 20° edizione, 5.48, punto 3.5.4)","(Schneider : Bautabellen für Bauingenieure, 20ème édition, 5.48, Point 3.5.4)","(Schneider: Bautabellen für Bauingenieure, 20. väljaanne, 5.48, punkt 3.5.4)",null,null,null,null,null,null,"(Schneider: Stavební tabulky pro stavební inženýry, 20. vydání, 5:48, bod 3.5.4)"]
["tc_)",")",")",")",")",")"]
["tc_?   ho","\u0082   Holz (nach  EN 1995-1-1/ B 1995-1-1)","\u0082   Timber (according to  EN 1995-1-1/ B 1995-1-1)","Legno (ai sensi della EN 1995-1-1/ B 1995-1-1)","\u0082   Bois (conformément à EN 1995-1-1/ B 1995-1-1)","?   Puit (vastavalt EN 1995-1-1/ B 1995-1-1)",null,null,null,null,null,null," Dřevo (dle  EN 1995-1-1 / B 01.1.1995)"]
["tc_?   ho2_","\u0082   Holz (EN 1995-1-1/ B 1995-1-1 und EN 1995-1-2)","\u0082   Timber (EN 1995-1-1/ B 1995-1-1 and EN 1995-1-2)","Legno (ai sensi della EN 1995-1-1/ B 1995-1-1 e EN 1995-1-2)","\u0082   Bois (EN 1995-1-1/ B 1995-1-1 et EN 1995-1-2)","?   Puit (EN 1995-1-1/ B 1995-1-1 ja EN 1995-1-2)",null,null,null,null,null,null," Dřevo (EN 1995-1-1 / B 1995-1-1 a EN 1995-1-2)"]
["tc_?  mat","①  Material :","①  Material :","① Materiale:","①  Matériau :","?  Materjal :",null,null,null,null,null,null,"① Materiál:"]
["tc_?  mat2_","②  Material :","②  Material :","② Materiale:","②  Matériau :","?  Materjal :",null,null,null,null,null,null,"② Materiál:"]
["tc_? beto1_","γ Beton","γ concrete","y Cemento","γ béton","? Betoon",null,null,null,null,null,null,"γ beton"]
["tc_? k,ho","ρ k,Holz","ρ k,timber","p k, legno","ρ k,bois","? k,wood",null,null,null,null,null,null,"ρ k, dřevo"]
["tc_? k,zw","ρ k,Zwischenlage","ρ k,intermediate layer","p k strato intermedio","ρ k,couche intermédiaire","? k,vahekiht",null,null,null,null,null,null,"ρ k, mezivrstva"]
["tc_? m(ho","γ M(Holz)","γ M(timber)","γ M(legno)","γ M(bois)","? M(puit)",null,null,null,null,null,null,"γ M (dřevo)"]
["tc_? m,st","γ M,St","γ M,St","γ M,St","γ M,St","? M,St",null,null,null,null,null,null,"γ M, St"]
["tc_\u0081\u0081  be","\u0081\u0081  Beton (nach EN 1992-1-1/ B 1992-1-1)","\u0081\u0081  Concrete (EN 1992-1-1/ B 1992-1-1)","Cemento (ai sensi della EN 1992-1-1/ B 1992-1-1)","\u0082  Béton (conformément à EN 1992-1-1/ B 1992-1-1)","Betoon (vastavalt standardile EN 1992-1-1/B 1992-1-1-1)",null,null,null,null,null,null,"Beton (EN 1992-1-1 / B 01.1.1992)"]
["tc_\u0081\u0081  be2_","\u0081\u0081  Beton (EN 1992-1-2, Tab. 5.8.)","\u0081\u0081  Concrete (EN 1992-1-2, Tab. 5.8.)","Cemento (EN 1992-1-2, Tab. 5.8.)","\u0082  Béton (conformément à EN 1992-1-2, tab. 5.8.)","Betoon (EN 1992-1-2, tabel 5.8.)",null,null,null,null,null,null,"Beton (EN 1992-1-2, tab. 5.8)."]
["tc_1. fre","1. Frequenzkriterium","1. Frequency criterion","1. Criterio di frequenza","1. Critère de fréquence","1. sageduskriteerium",null,null,null,null,null,null,"1.Kritérium frekvence"]
["tc_1. fre1_","1. Frequenzkriterium (nach Gleichung NA. 7.5-E1)","1. Frequency criterion (equ. NA. 7.5-E1)","1. Criterio di frequenza (secondo l'equazione  NA. 7.5-E1)","1. Critère de fréquence (conformément à l'équation FA. 7.5-E1)","1. sageduskriteerium (vastavalt võrrandile NA. 7.5-E1)",null,null,null,null,null,null,"1. Kritérium frekvence (rovnicí NA. 7,5-E1)"]
["tc_2. ste","2. Steifigkeitskriterium","2. Stiffness criterion","2. Criterio di rigidità","2. Critère de rigidité","2. jäikuse kriteerium",null,null,null,null,null,null,"2.Kritérium  tuhosti"]
["tc_2. ste1_","2. Steifigkeitskriterium (nach Gleichung NA. 7.2-E2, NA. 7.2-E3)","2. Stiffness criterion (equ. NA. 72-E2, NA. 7.2-E3)","2. Criterio di rigidità (secondo l'equazione NA. 7.2-E2, NA. 7.2-E3)","2. Critère de rigidité (conformément à l'équation FA. 7.2-E2, FA. 7.2-E3)","2. jäikuse kriteerium (vastavalt võrranditele NA. 7.2-E2, NA. 7.2-E3)",null,null,null,null,null,null,"2. Kritérium  tuhosti (rovnicí NA. 7,2-E2, NA, 7,2-E3)"]
["tc_3. bes","3. Beschleunigungskriterium (nach Gleichung NA. 7.2-E4 bis NA. 7.2-E6)","3. Accelleration criterion (equ NA. 7.2-E4 to NA. 7.2-E6)","3. Criterio di accelerazione (secondo l'equazione NA. 7.2-E4 -NA. 7.2-E6)","3. Critère d'accélération (conformément à l'équation FA. 7.2-E4 à FA. 7.2-E6)","Kolmas kiirenduskriteerium (vastavalt võrranditele NA. 7.2-E4 kuni NA. 7.2-E6)",null,null,null,null,null,null,"3. Kritérium akcelerace (podle rovnice NA. 7,2-E4 do NA. 7,2-E6)"]
["tc_3. sch","3. Schwingbeschleunigung","3. Accelleration","3 .Accelerazione alle vibrazioni","3. Accélération des vibrations","3. vibratsioonikiirendus",null,null,null,null,null,null,"3.Vibrační zrychlení"]
["tc_3s-pla","3S-Platte","3-layer panel","Soletta 3S","Dalle 3S","3S plaat",null,null,null,null,null,null,"3S-deska","Chiao"]
["tc_a","α calc","α calc","α calc","α calc","α calc",null,null,null,null,null,null,"α calc"]
["tc_a 1","A 1","A 1","A 1","A 1","A 1"]
["tc_a 12_","a 1","a 1","a 1","a 1","a 1"]
["tc_a 2","A 2","A 2","A 2","A 2","A 2"]
["tc_a 22_","a 2","a 2","a 2","a 2","a 2"]
["tc_a 4,vo","a 4,vorh","a 4,calc","a 4, pres.","a 4, exis","a 4,kingitus",null,null,null,null,null,null,"a4, před"]
["tc_a rms","a rms","a rms","a rms","a rms","a rms"]
["tc_a s,vo","a s,vorh,quer","a s,calc,cross","a s, pres., trasversale","a s,exist,tran","a s,ees,taga",null,null,null,null,null,null,"a ,s před, příčně"]
["tc_a v","a V","a V","a V","a V","a V"]
["tc_a: woh","A: Wohnflächen","A: residential buildings","A: superfici residenziali","A : surfaces habitables","A: Eluruum",null,null,null,null,null,null,"A: obytné plochy"]
["tc_a1   a","a1   Abstand der Schrauben untereinander parallel der Faserrichtung: ≥ {0} mm","a1   Distance between screws parallel to the grain direction: ≥ {0} mm","a1 Distanza delle viti tra loro parallelamente alla direzione delle fibre ≥ {0} mm","a1   Distance des vis entre elles parallèlement à la direction des fibres : ≥ {0} mm","a1 Kruvide vaheline kaugus paralleelselt kiu suunda: = {0} mm",null,null,null,null,null,null,"a1 vzdálenost  šroubů  pod sebou paralelně ke směru vláken:≥ {0} mm"]
["tc_a1) sc","a1) Schubspannungsnachweis am Verbundquerschnitt","a1) Shear stresses in composite section","a1) Prova della tensione di spinta sulla sezione trasversale composta","a1) Preuve de contrainte de cisaillement sur la section mixte","a1) Lõikepinge kontrollimine komposiidi ristlõikes",null,null,null,null,null,null,"a1) smykové napětí zjistit z příčného řezu spoje"]
["tc_a2   a","a2   Abstand der Schrauben untereinander rechtwinklig zur Faserrichtung: ≥ {0} mm","a2   Distance between screws perpendicular to the grain direction: ≥ {0} mm","a2 Distanza delle viti tra loro perpendicolarmente alla direzione delle fibre ≥ {0} mm","a2   Distance des vis entre elles perpendiculairement à la direction des fibres : ≥ {0} mm","a2 Kruvide vaheline kaugus risti kiu suunas: = {0} mm",null,null,null,null,null,null,"a2 vzdálenost  šroubů pod sebou   kolmo k vláknům: ≥ {0} mm"]
["tc_a2) qu","a2) Querkrafttragfähigkeit der Betonplatte als Teil des Verbundquerschittes","a2) Concrete shear capacity as part of the composite section","a2) Portata della forza di taglio della soletta di cemento armato come parte della sezione trasversale composta","a2) Force portante transversale de la dalle en béton en tant que partie de la section mixte","a2) Betoonplaadi kui liitristlõike osa nihkevõime kandevõime",null,null,null,null,null,null,"a2) pevnost  betonové desky jako součást příčného řezu spoje"]
["tc_a3   a","a3   Abstand der Schrauben zum beanspruchten Hirnholzende: ≥ 40mm","a3   Distance of screws to stressed end grain: ≥ 40mm","a3 Distanza delle viti rispetto all'estremità del legno tagliato trasversalmente: ≥ 40mm","a3   Distance des vis par rapport aux extrémités des bois de bout sollicitées : ≥ 40 mm","a3 Kruvide kaugus pingestatud tera otsast: = 40mm",null,null,null,null,null,null,"a3 vzdálenost šroubů k požadovanému konci  čelního dřeva: ≥ 40 mm"]
["tc_a4   r","a4   Randabstand rechtwinklig zur Faserrichtung: ≥ 30mm","a4   Edge distance perpendicular to the grain direction: ≥ 30mm","a4 Distanza bordo perpendicolarmente alla direzione della fibra: ≥ 30mm","a4   Distance des bords perpendiculairement à la direction des fibres : ≥ 30 mm","a4 Serva kaugus kiu suuna suhtes: = 30 mm.",null,null,null,null,null,null,"a4 vzdálenost od okraje kolmo k vláknům: ≥ 30 mm"]
["tc_abbran","Abbrand","Burning thickness","Perdita alla combustione","Perte au feu","Läbipõlemine",null,null,null,null,null,null,"Ohoření"]
["tc_abgebr","Abgebrannter Querschnitt","Burned section","Sezione bruciata","Coupe transversale incendiée","Põletatud ristlõige",null,null,null,null,null,null,"Ohořelý příčný řez"]
["tc_abmess","Abmessungen","Dimensions","Dimensioni","Dimensions","Mõõtmed",null,null,null,null,null,null,"Rozměry"]
["tc_abmind","Abminderung des Verschiebungsmoduls im Brandfall gem. EN 1995-1-2 Abschnitt 4.3.4: K fi = K u · 0,2","Stiffness reduction in case of fire according to EN 1995-1-2, 4.3.4: K fi = K u · 0,2","Riduzione del modulo di spostamento in caso di incendio ai sensi della EN 1995-1-2 sez. 4.3.4: K fi = K u · 0,2","Perte du module de déplacement en cas d'incendie conf. à EN 1995-1-2 Section 4.3.4 : K fi = K u · 0,2","nihkemooduli vähendamine tulekahju korral vastavalt EN 1995-1-2 punktile 4.3.4: K fi = K u - 0,2",null,null,null,null,null,null,"Snížení posuvného modulu v případu ohně. EN 1995-1-2 bod 4.3.4: K fi = K u · 0.2"]
["tc_abstan","Abstand der beiden äußersten Verbindungsmittel","Distance of the outermost screws","Distanza dei due elementi di giunzione più esterni","Distance entre les deux dispositifs d'assemblage les plus à l'extérieur","Kahe äärmise kinnitusdetaili vaheline kaugus",null,null,null,null,null,null,"Vzdálenost mezi dvěma nejvzdálenějšími spojovacími prostředky"]
["tc_abstan1_","Abstand der Träme","Distance between beams","Distanza delle travi","Distance des trames","Talade vaheline kaugus",null,null,null,null,null,null,"Vzdálenost trámů"]
["tc_acht","ACHTUNG! :","ATTENTION!:","ATTENZIONE!:","ATTENTION ! :","TÄHELEPANU :",null,null,null,null,null,null,"POZOR! :"]
["tc_allgem","ALLGEMEINE ANGABEN:","GENERAL INFORMATION:","INDICAZIONI GENERALI:","DONNÉES GÉNÉRALES :","ÜLDINE TEAVE:",null,null,null,null,null,null,"ZÁKLADNÍ INFORMACE:"]
["tc_andiekon","An die Konstruktion werden keine Anforderungen hinsichtlich der Brandwiderstandsdauer gestellt.","The construction doesn't have to fulfill any requirements in terms of fire resistance.","Alla costruzione non sono imposti requisiti in termini di durata della resistenza alle fiamme.","Aucune exigence n'est posée pour la construction quant à la durée de résistance au feu.","Konstruktsioonile ei esitata nõudeid seoses tulekindluse kestusega.",null,null,null,null,null,null,"Na konstrukci nejsou kladeny žádné požadavky z hlediska požární odolnosti."]
["tc_anford","Anforderungen an die Betonplatte im Brandfall:","Requirements to the concrete slab in case of fire:","Requisiti per la soletta in cemento in caso di incendio:","Exigences pour la dalle de béton en cas d'incendie :","Nõuded betoonplaadile tulekahju korral:",null,null,null,null,null,null,"Požadavky na betonovou desku v případě požáru:"]
["tc_angabe","Angaben zur Bemessung von {0} Verbundschrauben (Eingabeblatt)","Input data for preliminary design of {0} composite screws (Input sheet)","Dati per la misurazione preventiva delle viti di giunzione {0} (scheda)","Données sur la mesure préliminaire des vis composites {0} (feuille de saisie)","Teave {0} komposiitkruvide mõõtmete kohta (sisestusleht)",null,null,null,null,null,null,"Informace k předběžnému návrhu {0} kompozitních šroubů (vstupní list)"]
["tc_anzahl","Anzahl Verbindungsmittelreihen","Number of rows of screws","Serie di elementi di giunzione","Nombre de rangées de dispositifs d'assemblage","Sidemete ridade arv",null,null,null,null,null,null,"Počet  řad šroubů"]
["tc_anzschs","Anz. Schrauben pro 1-m-Streifen","Number of screws per width of 1 m ","Numero di viti per strisce di 1 m","Nbr. de vis par bande de 1 m","Kruvide arv 1 meetri riba kohta",null,null,null,null,null,null,"Počet šroubů na 1 m"]
["tc_anzscht","Anzahl Schrauben pro Träger","Number of screws per beam","Numero di viti per trave","Nombre de vis par support","Kruvide arv ühe toe kohta",null,null,null,null,null,null,"Počet šroubů na trámu"]
["tc_anzver","Anzahl Verbindungsmittelreihen","Number of rows of screws","Serie di elementi di giunzione","Nombre de rangées de dispositifs d'assemblage","Sidemete ridade arv",null,null,null,null,null,null,"Počet  řad šroubů"]
["tc_anzver1m","Anzahl Verbindungsmittelreihen pro 1m-Streifen","Number of rows of screws per width of 1 m","Serie di elementi di giunzione per strisce di 1 m","Nombre de rangées de dispositifs d'assemblage par bande de 1 m","Paelaridade arv 1 m pikkuse riba kohta",null,null,null,null,null,null,"Počet  řad šroubů na 1 m"]
["tc_anzver1mr","Anzahl Schraubenkreuzreihen pro 1m-Streifen","Number of screwcross-rows per 1 m width","numero di file di viti incrociate per 1 m di banda di riferimento","Nombre de rangées vissés en croix par bande de 1 m","Kruvide ristridade arv 1 m riba kohta"]
["tc_anzverr","Anzahl Schraubenkreuzreihen","Number of screwcross-rows","numero di file di viti incrociate","Nombre de rangées vissés en croix","Kruvide ristridade arv"]
["tc_auflag","Auflagerpressung Holz","Bearing compression in timber","Carico appoggio legno","Compression des appuis bois","Toetus rõhu all olev puit",null,null,null,null,null,null,"Ložisko komprese - dřevo"]
["tc_auflag1","Auflagerdruck","Bearing compression","Pressione appoggio","Réaction d'appui","Tugisurve",null,null,null,null,null,null,"Dosedací tlak"]
["tc_aus  t","Aus  t= ∞ rückgerechneter Beiwert zur Bestimmung der Kriechanteile aus der Anfangsdurchbiegung","Calculated value of t= ∞ from creep and initial displacements","Da   t= ∞ coefficiente ricalcolato per la determinazione delle percentuali di scorrimento dall'inflessione iniziale","Coefficient recalculé à partir de t = ∞ pour déterminer les phénomènes de fluage à partir de la flèche initiale","Koefitsient, mis on tagasi arvutatud t= â, et määrata roomamise komponendid algsest läbipaindest lähtuvalt",null,null,null,null,null,null,"Z  t = ∞ zpětně vypočtená hodnota pro určení součinitele  z počátečního prohnutí"]
["tc_ausfüh","Ausführung (nach Tabelle NA.7.2-E1)","Execution (Tab. NA.7.2-E1)","Esecuzione (secondo la tabella NA.7.2-E1)","Version (conformément au tableau FA.7.2-E1)","Versioon (vastavalt tabelile NA.7.2-E1)",null,null,null,null,null,null,"Provedení (dle tabulky NA.7.2-E1)"]
["tc_ausgef","AUSGEFÜLLT VON:","RESPONSIBLE:","COMPILATO DA:","REMPLI PAR :","TÄIDETUD:",null,null,null,null,null,null,"Vyplnil:"]
["tc_ausnut","Ausnutzung der Tragfähigkeit","Ultimate limit state utilisation","Sfruttamento della portata","Utilisation de la force portante","Kandevõime kasutamine",null,null,null,null,null,null,"Využití nosnosti"]
["tc_auswah","Auswahl ψ-Wert","Selction of ψ-value","Selezione valore ψ","Sélection de la valeur ψ","Valik ?väärtus",null,null,null,null,null,null,"Výběr ψ hodnoty"]
["tc_b ef,q","b ef,Q","b ef,Q","b ef,Q","b ef,Q","b ef,Q",null,null,null,null,null,null,"b ef, Q"]
["tc_b ef,q1_","b ef,Q = t+0,312*l quer","b ef,Q = t+0,312*l cross","b ef,Q = t+0,312*l trasv.","b ef,Q = t+0,312*l quer","b ef,Q = t+0,312*l põikisuunaline",null,null,null,null,null,null,"b ef, Q = t + 0,312 * l příčně"]
["tc_b eff","b eff","b eff","b eff","b eff","b eff",null,null,null,null,null,null,"b eff"]
["tc_b) sch","b) Schubtragfähigkeit  des Holzquerschnittes ohne Mitwirkung des Betonquerschnittes","b) Shear capacity of the timber section without contribution of the concrete part","b) Portata spinta della sezione in legno senza azione da parte della sezione in cemento","b) Résistance au cisaillement de la coupe transversale du bois sans la participation de la coupe transversale du béton","b) puidu ristlõike nihkekandevõime ilma betoonist ristlõike osaluseta",null,null,null,null,null,null,"b) smyková nosnost průřezu dřeva bez účasti betonového dílce"]
["tc_b: bür","B: Büroflächen","B: office areas","B: superfici ad uso ufficio","B : surfaces de bureau","B: kontoriruumid",null,null,null,null,null,null,"B: kancelářské prostory"]
["tc_bauart","Bauart:","Type of construction:","Tipo di costruzione:","Type de construction :","Disain:",null,null,null,null,null,null,"Typ stavby:"]
["tc_bauvor","BAUVORHABEN:","PROJECT:","PROGETTO COSTRUTTIVO:","PROJET DE CONSTRUCTION :","EHITUSMENETLUSED:",null,null,null,null,null,null,"Projekt:"]
["tc_bauvor2_","Bauvorhaben:","Project:","Progetto costruttivo:","Projet de construction :","Ehitusprojekt:",null,null,null,null,null,null,"Stavební projekt:"]
["tc_beansp","Beanspruchung der Verbindungsmittel (nach EN 1995-1-1:2014, Anhang B)","Screw stresses (according to EN 1995-1-1:2014, Appendix B)","Sollecitazione degli elementi di giunzione (ai sensi della EN 1995-1-1:2014, allegato B)","Sollicitation des dispositifs d'assemblage (conformément à EN 1995-1-1 : 2014, Annexe B)","Kinnitusdetailide koormus (vastavalt EN 1995-1-1:2014, lisa B)",null,null,null,null,null,null,"Nároky  na spojovací prostředky (dle EN 1995-1-1: 2014, Annex B)"]
["tc_beimehr"," Bei mehreren nebeneinander liegenden 'Bäumen' wird die Anordnung einer Schraubenreihe je 'Baum' empfohlen."," It is recommended to use at least one row of screws for each of the members that lie side by side. ","Per tutti i componenti/elementi che si trovano uno accanto all'altro occorre utilizzare almeno una fila di viti.","Pour plusieurs composants placés l'un à côté de l'autre, au moins une rangée de vis par composant doit être disposée."," Kui on mitu kõrvuti asetsevat \"puud\", soovitame paigutada ühe kruvirea iga \"puu\" kohta.",null,null,null,null,null,null," V případě většího počtu vedle sebe umístěných součástí,by měla být umístěna alespoň jedna řada šroubů na stavební dílec."]
["tc_beiwer","Beiwert zur Berücksichtigung des Einflusses der Eigenfrequenz auf die Schwingbeschleunigung","Factor for the influence of the frequency on the accelleration.","Coefficiente per considerare l'influsso della frequenza propria sull'accelerazione da vibrazioni","Coefficient pour déterminer l'influence de la fréquence propre sur l'accélération des vibrations","Koefitsient, mis võtab arvesse loodussageduse mõju vibratsioonikiirendusele.",null,null,null,null,null,null,"Koeficient pro posouzení vlivu vlastní frekvence zrychlení kmitání"]
["tc_belast","BELASTUNG:","LOADS:","CARICO:","CHARGE :","LAADIMINE:",null,null,null,null,null,null,"Zatížení"]
["tc_belast1_","Belastung durch frischen Aufbeton","Loads caused by wet concrete","Carico da soletta in cemento armato fresco","Charge due à la couche de finition fraîche","Värske betooni põhjustatud koormus",null,null,null,null,null,null,"Zatížení čerstvým betonem"]
["tc_bemess","Bemessungswerte der Beanspruchung je Schraube","Design values of screw stresses","Valori di dimensionamento della sollecitazione per vite","Valeurs de mesure de la sollicitation par vis","Pingete arvutuslikud väärtused kruvi kohta",null,null,null,null,null,null,"Návrhové hodnoty napětí na šroubu"]
["tc_bemess1_","Bemessung","Design","Dimensionamento","Mesure","Dimensiooni määramine",null,null,null,null,null,null,"Návrh"]
["tc_bemess2_","Bemessung als Schalung aus Brettern","Design as formwork consisting of boards","Dimensionamento come armatura realizzata con assi","Mesure en tant que coffrage constitué de planches","Mõõtmine laudadest valmistatud šabloonina",null,null,null,null,null,null,"Návrh- bednění z prken"]
["tc_bemess3_","Bemessung als Schalung aus OSB 3","Design as formwork consisting of OSB 3","Dimensionamento come armatura di OSB 3","Mesure en tant que coffrage en OSB 3","Mõõtmine OSB-plaadist valmistatud šabloonina 3",null,null,null,null,null,null,"Návrh- bednění z OSB 3"]
["tc_bemess4_","Bemessung als Schalung aus einer 3s-Platte","Design as formwork consisting of three-layer panels","Dimensionamento come armatura di una soletta 3s","Mesure en tant que coffrage constitué d'une dalle 3s","Mõõdistamine 3s paneelist vormimaterjalina",null,null,null,null,null,null,"Návrh-  bednění 3s desky"]
["tc_bemess5_","Bemessung im Brandfall (","Fire design (","Misurazione in caso di incendio","Mesure en cas d'incendie (","Mõõtmine tulekahju korral (",null,null,null,null,null,null,"Návrh v případě požáru "]
["tc_berebla","Berechnungsblatt","Calculation sheet","Foglio di calcolo","Fiche de calcul","Arvutusleht",null,null,null,null,null,null,"List výpočtu"]
["tc_berech","Berechnungswerte für Eigengewicht","Calculation values of dead loads","Valori di calcolo per peso proprio","Valeurs de calcul pour le poids propre","Taarakaalu arvutusväärtused",null,null,null,null,null,null,"Výpočet hodnoty hmotnosti"]
["tc_berech2","Berechnung mitwirkende Plattenbreite (nach EN 1992-1-1 Punkt 5.3.2.1)","Effective slab width (acc. to EN 1992-1-1 Punkt 5.3.2.1)","Calcolo ampiezza soletta concomitante (ai sensi della EN 1992-1-1 punto 5.3.2.1)","Calcul de la largeur de la dalle qui participe (conformément à EN 1992-1-1 Point 5.3.2.1)","Paneeli efektiivse laiuse arvutamine (vastavalt EN 1992-1-1 punktile 5.3.2.1)",null,null,null,null,null,null,"Výpočet spolupůsobení šířky desky (dle  EN 1992-1-1 bod 5.3.2.1)"]
["tc_berück","Berücksichtigung des Durchbiegungsanteiles aus Eigengewicht g1","Calculation of deflection from self weight g1","Considerazione della percentuale dell'inflessione dal peso proprio g1","Prise en compte des parts de flèche à partir du poids propre g1","Tühimassist tuleneva läbipainde komponendi g1 arvestamine",null,null,null,null,null,null,"Zohlednění vychýlení z vlastní hmotnosti g1"]
["tc_bestan","Bestand","Existing building","Durata","Stock","Varud",null,null,null,null,null,null,"Stav"]
["tc_bestand","Bestehende Holzbauteile sind hinsichtlich ihrer Festigkeitseigenschaften zu überprüfen. Im Allgemeinen wird die Berechnung mit  Kennwerten der nächst niedrigeren Festigkeitsklasse empfohlen.","Built-in timber members have to be checked regarding their mechanical resistance properties. Commonly the timer grade is decreased by one class.","I componenti esistenti in legno devono essere controllati per quanto riguarda la resistenza delle loro caratteristiche. In generale il calcolo con i valori raccomanda la classe di resistenza immediatamente inferiore.","Les composants en bois existants doivent être vérifiés quant à leurs propriétés de résistance. En règle générale, le calcul avec des valeurs caractéristiques de la classe de résistance inférieure est recommandé.","Olemasolevaid puitdetaile tuleb kontrollida nende tugevusomaduste osas. Üldiselt on soovitatav arvutada järgmise madalama tugevusklassi iseloomulike väärtustega.",null,null,null,null,null,null,"Stávající dřevěné prvky mají být kontrolovány s ohledem na jejich pevnost . Obecně platí, že výpočet se doporučuje určit hodnotami další nižší pevnostní třídy."]
["tc_beton","Beton","Concrete","Cemento","Béton","Betoon",null,null,null,null,null,null,"Beton"]
["tc_betonallein","Die Betonplatte alleine erfüllt die gewählte Feuerwiderstandsklasse ","The concrete slab alone fulfills the required fire resistance class ","La soletta in cemento soddisfa la classe  di resistenza alle fiamme selezionata","La dalle de béton seule satisfait à la classe de résistance au feu choisie ","Ainult betoonplaat vastab valitud tulepüsivusklassile.",null,null,null,null,null,null,"Betonová deska sama splňuje zvolenou třídu odolnosti vůči požáru"]
["tc_betond","Betondeckung c","Concrete covering c","Rivestimento in cemento c","Couverture de béton c","Betoonkate c",null,null,null,null,null,null,"Betonové zakrytí c"]
["tc_betond2_","Betondruckspannung","Concrete compression stress","Tensione pressione cemento","Effort de compression du béton","Betooni survetugevus",null,null,null,null,null,null,"Napětí tlaku betonu"]
["tc_betonf","Betonfestigkeitsklassen lt. EN 1992-1-1, Tab. 3.1","concrete strength class acc. to EN 1992-1-1, Tab. 3.1","Classi di resistenza cemento secondo la EN 1992-1-1, tab. 3.1","Classes de résistance du béton d'ap. EN 1992-1-1, tab. 3.1","Betooni tugevusklassid vastavalt EN 1992-1-1, tabel 3.1.",null,null,null,null,null,null,"Třídy  pevnosti betonu. EN 1992-1-1, tab. 3.1"]
["tc_betonier","aus dem Betonieren im Bauzustand","from concreting in the construction stage",null,"du bétonnage tel que construit","betoneerimisest ehitusjärgus"]
["tc_betonü","Betonüberdeckung Schraubenkopf","Concrete covering screw head","Copertura in cemento testa della vite","Enrobage béton tête de vis","Betoonkatte kruvipea",null,null,null,null,null,null,"Betonový kryt hlavy šroubu"]
["tc_betonz","Betonzugbewehrung","Reinforcement","Armatura trazione cemento","Barre d'armature du béton","Betooni tõmbetugevus",null,null,null,null,null,null,"Výztuž betonu"]
["tc_betrac","Betrachtung der Schalung zum Zeitpunkt des Betonierens als Einfeldträger ","At time of concreting, the formwork is calculated as a simple supported beam.","Esame dell'armatura al momento della gettata di cemento come trave ad una campata","Observation du coffrage au moment du bétonnage en tant que poutre simple ","Betoneerimise ajal betoneeritava vundamendi käsitlemine üheprofiililise palgina",null,null,null,null,null,null,"Posouzení bednění při betonáži jednoduše podepřeného trámu"]
["tc_bewehr","Bewehrungsmatten lt. ÖNORM B 4707 (DIN 488-4)","reinforcement mesh as in ÖNORM B 4707 (DIN 488-4)","Pannelli armatura ai sensi della ÖNORM B 4707 (DIN 488-4)","Treillis métalliques d'ap. ÖNORM B 4707 (DIN 488-4)","Armeerimisvõrk vastavalt ÖNORM B 4707 (DIN 488-4)",null,null,null,null,null,null,"Pletivo výztuže lt. ÖNORM B 4707 (DIN 488-4)"]
["tc_bewehr2_","Bewehrungsmatten","Reinforcement mesh","Pannelli armatura ","Treillis métalliques","Tugevdusvõrk",null,null,null,null,null,null,"Pletivo výztuže"]
["tc_bewehra","Maschenweite in Längsrichtung: {0} mm","Longitudinal mesh-width: {0} mm","larghezza delle maglie nel verso della lunghezza: {0} mm","Largeur des mailles dans le sens longitudinal : {0} mm","Võrgusilma suurus pikisuunas: {0} mm",null,null,null,null,null,null,"\nVelikost ok v podélném směru: {0} mm"]
["tc_bezeic","Bezeichnung","Denotation","Descrizione","Désignation","Nimetus",null,null,null,null,null,null,"Označení"]
["tc_bieges","Biegesteifigkeit des Gesamtquerschnittes","Bending stiffness of the total composite section","Resistenza alla flessione della sezione complessiva","Rigidité en flexion de l'ensemble de la coupe transversale","Üldise ristlõike paindumisjäikus",null,null,null,null,null,null,"Tuhost  ohybu v celém průřezu"]
["tc_bieges1_","Biegesteifigkeit der Decke in Deckenspannrichtung","Bending stiffness of the slab in main span direction","Resistenza alla flessione del solaio nella direzione di serraggio del solaio","Rigidité en flexion du plafond dans le sens de la contrainte exercée sur le plafond","Lae paindumisjäikus lae sirgumise suunas",null,null,null,null,null,null,"Tuhost  ohybu  stropu ve  směru rozpětí stropu"]
["tc_bieges2_","Biegesteifigkeit der Decke quer zur Deckenspannrichtung","Bending stiffness of the slab perp. to main span direction","Resistenza alla flessione del solaio trasversalmente alla direzione di serraggio del solaio","Rigidité en flexion du plafond en travers du sens de la contrainte exercée sur le plafond","Lae paindumisjäikus põikisuunas lae sirgumise suunas",null,null,null,null,null,null,"Tuhost  ohybu  stropu napříč ke směru rozpětí stropu"]
["tc_biegun","Biegung","Bending","Flessione","Flexion","Painutamine",null,null,null,null,null,null,"Ohyb"]
["tc_brandb","Brandbemessung","Fire design","Misurazione fiamme","Mesure en cas d'incendie","Tulekahju dimensioneerimine",null,null,null,null,null,null,"Záměr v případě požáru"]
["tc_breite","Breite","Width","Larghezza","Largeur","Laius",null,null,null,null,null,null,"Šířka"]
["tc_breite1_","Breite des Deckenfeldes","Width perp. to main span direction","Larghezza della campata del solaio","Largeur du plafond","Laepaneeli laius",null,null,null,null,null,null,"Šířka stropního panelu"]
["tc_brette","Bretterlage C24","Boards C24","Posizione assi C24","Couche de planches C24","Plaadi kiht C24",null,null,null,null,null,null,"Vrstva desek C24"]
["tc_bst 55","BST 550","BST 550","BST 550","BST 550","BST 550",null,null,null,null,null,null,"BST 550"]
["tc_bvpn","Bauvorhaben: {0}\nPos.Nr.: {1}","Project: {0}\nPos.no.:","Progetto costruttivo: {0}\nPos. n.: {1}","Projet de construction : {0}\nPos. n° : {1}","Ehitusprojekt: {0}%APos.nr.: {1}",null,null,null,null,null,null,"Projekt: {0} \nPos.Nr:. {1} "]
["tc_bye","Tschüss","Bye","Ciao","Au revoir","Bye bye",null,null,null,null,null,null,"ahoj"]
["tc_c s","c s","c s","c s","c s","c s",null,null,null,null,null,null,"c s"]
["tc_c: per","C: Personenansammlungen","C: Assembly","C: assembramenti di persone","C : attroupements","C: Rahvamassid",null,null,null,null,null,null,"C: Shromáždění lidí"]
["tc_car","Auto","Car","Auto","Auto","Auto",null,null,null,null,null,null,"Auto"]
["tc_charak","Charakteristische Bemessungssituation","Characteristic design situation","Situazione di dimensionamento caratteristica","Situation de mesure caractéristique","Iseloomulik dimensioneerimise olukord",null,null,null,null,null,null,"Charakteristická situace návrhu"]
["tc_d","d","d","d","d","d"]
["tc_d: ver","D: Verkaufsflächen","D: sales areas","D: superfici per la vendita","D : surfaces de vente","D: jaemüügipinnad",null,null,null,null,null,null,"D: prodejní plochy"]
["tc_dämpfu","Dämpfungsgrad","Damping","Grado di smorzamento","degré d'amortissement","Summutusaste",null,null,null,null,null,null,"Stupeň útlumu"]
["tc_datum:","DATUM:","Date:","DATA: ","DATE :","KUUPÄEV:",null,null,null,null,null,null,"DATUM:"]
["tc_dbüber","Die Betonüberdeckung des Schraubenkopfes ist zu gering!","The concrete covering of the screw head is  too small!","Il rivestimento in cemento della testa della vite è insufficiente!","L'enrobage béton de la tête de vis est trop faible !","Kruvide pea betoonkate on liiga väike!",null,null,null,null,null,null,"Krycí vrstva betonu hlavy šroubu je příliš malá!"]
["tc_deckek","Deckenklasse III","Floor vibration class III","Classe copertura III","Catégorie de plafond III","III klassi ülemine lagi",null,null,null,null,null,null,"Třída zakrytí III"]
["tc_decken","Deckenklasse I","Floor vibration class I","Classe copertura I","Catégorie de plafond I","Laeklass I",null,null,null,null,null,null,"Třída zakrytí I"]
["tc_decken2_","Deckenklasse II","Floor vibration class II","Classe copertura II","Catégorie de plafond II","II klassi ülemine lagi",null,null,null,null,null,null,"Třída zakrytí II"]
["tc_der sc","der Schraube","of the screw","della vite","de la vis","kruvi",null,null,null,null,null,null,"Šroub"]
["tc_der sc2_","Der Schwingungsnachweis ist für folgende Deckenklasse erfüllt:","The floor vibration behaviour is classified as:","La comprova delle oscillazioni per la seguente classe di solette è soddisfatta:","La preuve de vibration est remplie pour la catégorie de plafond suivante :","Vibratsiooni kontroll on täidetud järgmise laeklassi puhul:",null,null,null,null,null,null,"Detekce vibrace jsou pro následující třídy :"]
["tc_derf1","Die erforderlichen Schraubenabstände gem. Zulassung werden nicht eingehalten. Die Anzahl der Verbindungsmittelreihen muss verringert werden.","Required screw distance according to the technical apporval is not met. Reduce the number of screw rows.","Non vengono rispettate le distanze delle viti necessarie secondo l'omologazione. Il numero delle serie di elementi di giunzione deve essere ridotto.","Les distances nécessaires entre les vis conf. à l'agrément ne sont pas respectées. Le nombre de rangées de dispositifs d'assemblage doit être réduit.","Nõutav kruvide vahekaugus vastavalt tüübikinnitusele ei ole täidetud. Kinnitusridade arvu tuleb vähendada.",null,null,null,null,null,null,"Nutné rozteče šroubů  nejsou dodrženy. Počet řad spojovacích prostředků musí být snížen."]
["tc_diagabst","Abstand vom Auflager A [m]","Distance from support A [m]","Distanza dall'appoggio A [m]","Distance de l'appui A [m]","Kaugus toest A [m]",null,null,null,null,null,null,"Vzdálenost od podpěry A [m]"]
["tc_diagausr","Für positive Werte von F d sind die Schraubenköpfe nach links auszurichten,\nfür negative Werte nach rechts.","For positive values of F d, the screw heads are to lean to the left. For negative values they are to lean to the right.","Per quanto riguarda i valori positivi di F d, le teste delle viti devono essere allineate a sinistra, per i valori negativi invece a destra.","Si les valeurs de F d sont positives, les têtes de vis doivent être alignées vers la gauche, pour des valeurs négatives, vers la droite.","F d positiivsete väärtuste korral peavad kruvide pead olema joondatud vasakule, negatiivsete väärtuste korral paremale.",null,null,null,null,null,null,"\"Hlavy šroubů musí být přiřazeny k levé straně, aby dosáhly pozitivních hodnot F d, pro záporné hodnoty je  pravá strana. \"  "]
["tc_diaschub","Schubkraft je Schraube [kN]","Shear force per screw [kN]","Spinta per vite [kN]","Effort de cisaillement par vis [kN]","Nihkejõud poldi kohta [kN]",null,null,null,null,null,null,"Tah na šroub [kN]"]
["tc_dicke ","Dicke der Schicht ohne Festigkeit","Thickness of layer without resistance","Spessore dello strato senza stabilità","Épaisseur de la couche sans résistance","Ilma tugevuseta kihi paksus",null,null,null,null,null,null,"Tloušťka vrstvy bez síly (pevnosti, odporu)"]
["tc_die ab","Die Abbrandtiefe ist so groß, dass die Schrauben bereits voll dem Brand ausgesetzt sind!","Charring depth already reaches screws in case of fire!","La profondità della combustione è talmente grande che le viti sono già esposte completamente alle fiamme!","La profondeur de carbonisation est telle que les vis sont déjà complètement exposées à l'incendie !","Põlemissügavus on nii suur, et kruvid on juba täielikult tulele avatud!",null,null,null,null,null,null,"Hloubka zuhelnatění je tak velká, že jsou šrouby  plně vystaveny ohni!"]
["tc_die be","Die Betonplatte alleine erfüllt die geforderten Kriterien für die gewählte Feuerwiderstandsklasse ","The concrete slab alone fulfills the required criteria of the required fire resistance class.","La soletta in cemento soddisfa i requisiti richiesti per la classe di resistenza alle fiamme selezionata","La dalle en béton seule satisfait aux critères exigés pour la classe de résistance au feu choisie ","Betoonplaat üksi vastab valitud tulepüsivusklassile nõutavatele kriteeriumidele.",null,null,null,null,null,null,"Betonová deska sama splňuje požadovaná kritéria pro vybranou třídu požární odolnosti."]
["tc_die be1_","Die Betonplatte alleine erfüllt die geforderten Kriterien für die gewählte Feuerwiderstandsklasse {0} nicht! Die Betonplattendicke h 1 muss erhöht werden bzw. sind genauere Untersuchungen am Gesamtquerschnitt notwendig.","The concrete slab alone doesn't fulfill the required criteria of the required fire resistance class {0}! The concrete slab thickness h 1 has to be increased. More detailed analsysis on the full cross-section may be required.","La soletta in cemento non soddisfa i requisitii richiesti per la classe  di resistenza alle fiamme selezionata (0)! Lo spessore della soletta in cemento h 1 deve essere aumentato o sono necessarie prove più precise sulla sezione trasversale totale.","La dalle en béton seule ne satisfait pas aux critères exigés pour la classe de résistance au feu {0} choisie ! L'épaisseur de la dalle en béton h 1 doit être augmentée ou des examens plus précis de l'ensemble de la coupe transversale sont nécessaires.","Betoonplaat üksi ei vasta valitud tulepüsivusklassi {0} nõuetele! Betoonplaadi paksust h 1 tuleb suurendada või on vaja üksikasjalikumat analüüsi kogu ristlõike kohta.",null,null,null,null,null,null,"Betonová deska sama nesplňuje požadovaná kritéria pro vybranou třídu požární odolnosti  {0}! Tloušťka betonové desky  h 1 musí být zvýšen,př. jsou nezbytné podrobnější studie na celém úseku."]
["tc_die be2_","Die Betonplatte alleine erfüllt die geforderten Kriterien für die gewählte Feuerwiderstandsklasse ","The concrete slab alone fulfills the criteria of the required fire resistance class.","La soletta in cemento soddisfa i requisiti richiesti per la classe di resistenza alle fiamme selezionata","La dalle en béton seule satisfait aux critères exigés pour la classe de résistance au feu choisie ","Betoonplaat üksi vastab valitud tulepüsivusklassile nõutavatele kriteeriumidele.",null,null,null,null,null,null,"Betonová deska sama splňuje požadovaná kritéria pro vybranou třídu požární odolnosti."]
["tc_die ei","Die Einwirkung durch Betonieren wird als kurzzeitige Last mit k mod = 1,0 angesetzt.","The loading from concreting is considered to be a short term load with k mod = 1,0.","L'effetto della gettata di cemento viene applicato come carico a breve termine con k mod. = 1,0","L'effet obtenu avec le bétonnage est appliqué en tant que charge brève avec k mod = 1,0.","Betoneerimise mõju tunnistatakse lühiajalise koormusena, mille k mod = 1,0.",null,null,null,null,null,null,"Účinek betonování je uznáván jako krátkodobé zatížení  s k mod = 1,0."]
["tc_die in","Die in diesem Bemessungsvorschlag durchgeführten Berechnungen gelten nur für {0}-Schrauben der Firma {1}.","This calculations apply only to {0}-Screws of {1}.","I calcoli presenti in questo prospetto si applicano solo alle viti {0} della ditta {1}.","Les calculs réalisés dans la présente proposition de mesure ne s'appliquent qu'à des vis {0} es de la société {1}.","Käesolevas konstruktsiooniettepanekus tehtud arvutused kehtivad ainult {0} poldi {1} suhtes.",null,null,null,null,null,null,"Výpočty prováděné v  dimenzování návrhu  platí pouze pro {0}-šrouby {1}."]
["tc_die ma","Die maßgebende Querkraft wird im Abstand von h2 vom Auflager ermittelt.","The design shear force is calculated at the distance of h2 from the support.","La forza di taglio determinante viene determinata a distanza di h2 dal supporto","La force transversale décisive est calculée avec une distance de h2 avec l'appui.","Otsustav nihkejõud määratakse kindlaks toetusest h2 kaugusel.",null,null,null,null,null,null,"Rozhodující smyková síla je stanovena ve vzdálenosti H2 od nosníku."]
["tc_die sp","Die Spannungen werden für eine unterstellte Decke ohne Einflüsse aus dem Bauzustand ermittelt.","Stresses are calculated for slabs that are continuously supported during concreting.","Le tensioni vengono rilevate per un solaio sottostante senza alcun influsso dalla condizione costruttiva.","Les contraintes sont calculées pour un plafond inférieur sans influence sur l'état de la construction.","Pinged on määratud eeldatava lae puhul, mis ei ole mõjutatud hoone seisundist.",null,null,null,null,null,null,"Napětí se stanoví pro podepřené stropy nezávisle na etapě výstavby."]
["tc_dies e","Dies entspricht einer Durchbiegung bezogen auf die Spannweite von:","This corresponds to a deflection relative to a span width of:","Questo corrisponde ad un'inflessione riferita alla luce di:","Cela correspond à une flèche relative à l'envergure de :","See vastab läbipainde suhtes:",null,null,null,null,null,null,"To odpovídá vychýlení vztahující se k rozpětí:"]
["tc_dieser","Dieser Bemessungsvorschlag gilt für {0}-Schrauben der Firma {1} und kann vom Verantwortlichen mit einschlägigen Befugnissen in die Erstellung einer statischen Berechnung integriert werden.","This calculation applies only to {0}-Screws of {1} and can be integrated into a structural analysis by the responsible person.","Questa proposta di calcolo si applica alle viti {0} della ditta {1} e può essere utilizzata nella realizzazione di un'analisi statistica da un responsabile con poteri adeguati.","Cette proposition de mesure s'applique à des vis {0} es de la société {1} et peut être intégrée à l'établissement d'un calcul statique par des responsables en possession des autorisations correspondantes.","Käesolev konstruktsiooniettepanek kehtib {0} ettevõtte {1} poltide kohta ja seda võib vastavate volitustega vastutav isik integreerida struktuurianalüüsi koostamisse.",null,null,null,null,null,null,"Tento návrh dimenzování se vztahuje na {0}-šrouby firmy  Schmid  Hainfeld GmbH a mohou být integrovány odpovědnou osobou s patřičnými pravomocemi pro vytvoření statického výpočtu."]
["tc_differ","Differenzschwindmaß = Endschwindmaß","Differential shrinkage = end shrinkage","Differenza del coefficiente di contrazione = coefficiente di contrazione finale","Coefficient de retrait différentiel = coefficient de retrait final","Diferentsiaalne kokkutõmbumine = lõplik kokkutõmbumine",null,null,null,null,null,null,"Diferenční smršťování = konečná míra"]
["tc_dminüb","Die Mindestüberdeckung des Schraubenkopfes wird eingehalten.","Concrete covering of the screw head is within limits.","Viene rispettato il rivestimento minimo della testa della vite.","L'enrobage minimum de la tête de vis est respecté.","Kruvipea minimaalne kattuvus säilib.",null,null,null,null,null,null,"Minimální zakrytí hlavy šroubu je v rámci limitu"]
["tc_dmit","Decken mit Querverteilungswirkung","Slabs with transversal distribution of loads","Copertura con effetto distribuzione trasversale","Plafonds avec effet de répartition transversale","Ristjaotuse mõjuga piirded",null,null,null,null,null,null,"Desky s příčně rozloženým efektem"]
["tc_dohne","Decken ohne Querverteilungswirkung","Slabs without transversal distribution of loads","Copertura senza effetto distribuzione trasversale","Plafonds sans effet de répartition transversale","Ilma ristjaotuse efektita ülemmäärad",null,null,null,null,null,null,"Desky bez příčně rozloženého efektu"]
["tc_dreiabb","dreiseitiger Abbrand","charring from three sides","Combustione su tre lati","Perte au feu sur trois côtés","kolmepoolne põlemine",null,null,null,null,null,null,"Ohoření ze 3 stran"]
["tc_durchb","Durchbiegungen","Deflections","Inflessioni","Flèches","Kõrvalekaldeid",null,null,null,null,null,null,"Odchylky"]
["tc_durchb1_","Durchbiegung in Feldmitte","Deflection at mid span","Inflessione al centro della campata","Flèche au centre","Teisaldamine väljaku keskel",null,null,null,null,null,null,"Odchylky uprostřed rozpětí"]
["tc_e 1","E 1","E 1","E 1","E 1","E 1",null,null,null,null,null,null,"E 1"]
["tc_e 2","E 2","E 2","E 2","E 2","E 2",null,null,null,null,null,null,"E 2"]
["tc_e: lag","E: Lager und industrielle Nutzung","E: storage areas and industrial buildings","E: magazzino e utilizzo industriale","E : entrepôt et exploitation industrielle","E: ladustamine ja tööstuslik kasutamine",null,null,null,null,null,null,"E: skladování i průmyslové využití"]
["tc_ef","ef","ef","ef","ef","ef",null,null,null,null,null,null,"ef"]
["tc_effekt","Effektiver Schraubenabstand","Effective distance of screws","Distanza effettiva viti","Distance réelle entre les vis","Tõhus kruvide vahekaugus",null,null,null,null,null,null,"Efektivní odstup šroubu"]
["tc_effekt1_","Effektivwert der Schwingbeschleunigung","Effective value of accelleration","Valore effettivo dell'accelerazione alle vibrazioni.","Valeur réelle de l'accélération des vibrations","Vibratsioonikiirenduse efektiivne väärtus",null,null,null,null,null,null,"Efektivní hodnota zrychlení vibrací"]
["tc_eig","eig","self","prop.","pro","oma",null,null,null,null,null,null,"Vlastní"]
["tc_eigeng","Eigengewicht g1,k:","Dead load g1,k:","Peso proprio g1,k","Poids propre g1,k :","Taaramass g1,k:",null,null,null,null,null,null,"Hmotnost g1, k:"]
["tc_eigeng1_","Eigengewicht","Dead load","Peso proprio","Poids propre","Surnud kaal",null,null,null,null,null,null,"Hmotnost"]
["tc_eigent","Eigenträgheitsmomente","Indiv.moments of inertia","Momenti inerzia intrinseca","Moments d'inertie propres","Inertsmoment",null,null,null,null,null,null,"Moment setrvačnosti"]
["tc_einabb","einseitiger Abbrand","Single sided fire","Combustione su un lato","Perte au feu unilatérale","ühepoolne põletamine",null,null,null,null,null,null,"Jednostranné ohoření"]
["tc_einbindt","Einbindetiefe des oberen Gewindeendes","Depth of upper thread part","Profondità di giunzione dell'estremità filettata superiore","Profondeur d'encastrement de la tige filetée supérieure","Ülemise niidi otsa sisselaske sügavus",null,null,null,null,null,null,"Kotvení horní části závitu"]
["tc_eingabla","Eingabeblatt","Input sheet","Foglio dati","Feuille de saisie","Sisendleht",null,null,null,null,null,null,"Vstupní list"]
["tc_eingeh","eingehalten","met","Rispettato","respecté(e)","täidetud",null,null,null,null,null,null,"Zachováno"]
["tc_eingehn","nicht eingehalten","not met","Non rispettato","non respecté(e)","ei ole täidetud",null,null,null,null,null,null,"Nezachováno"]
["tc_einsei","einseitig","single sided","Su un lato","unilatéral(e)","ühepoolne",null,null,null,null,null,null,"Jednostranně"]
["tc_einwi2","Einwirkung (F d aus V d)","Stress (Fd from Vd)","Effetto (Fd da Vd)","Effet (F d à partir de V d)","Mõju (F d alates V d)",null,null,null,null,null,null,"Účinek (F d od Vd)"]
["tc_einwir","Einwirkungskombination Brand","Load combination fire","Combinazione effetti delle fiamme","Effets combinés de l'incendie","Kokkupuute kombinatsioon Tulekahju",null,null,null,null,null,null,"Požár - účinná kombinace"]
["tc_einwir2_","Einwirkungen","Loads","Effetti ","Effets","Mõju",null,null,null,null,null,null,"Účinky"]
["tc_einwir3_","Einwirkungen und Schnittgrößen","Stresses and inner forces","Effetti e grandezze taglio","Effets et tailles des coupes","Meetmed ja sisemised jõud",null,null,null,null,null,null,"Účinky a síly"]
["tc_einz02","aus Stützenlast oder Auswechslung; pro Tram.","from columns or cross-beams; per main beam.","da carico di appoggio o sostituzione; per trave princ.","à partir des piliers ou des solives de remplissage ; par trame.","tugikoormusest või asendamisest; trammi kohta.",null,null,null,null,null,null,"Z e zatížení podpor či příčníků, na trám"]
["tc_einzel","Einzellast Qk","Concentrated load Qk","Carico singolo Qk","Charge individuelle Qk","Ühekordne koormus Qk",null,null,null,null,null,null,"Zatížení Qk"]
["tc_einzel1_","Einzellast","Concentrated load","Carico singolo","Charge individuelle","Üksik koormus",null,null,null,null,null,null,"Zatížení"]
["tc_einzell5","EINZELLAST:","CONC. LOAD:","CARICO SING.:","CHARGE INDIV.:","ÜHE RAKU KOORMUS:",null,null,null,null,null,null,"ZATÍŽENÍ:"]
["tc_einzell5b","aus Stützenlast oder Auswechslung, bezogen auf den Querschnittswiderstand b eff = {0} cm","from columns or cross-beams, in reference to a cross-section resistance width b eff = {0} cm","da carico di appoggio o sostituzione, riferito alla resistenza trasversale b eff. = {0} cm","à partir des piliers ou des solives de remplissage, relatifs à la résistance de la coupe transversale b eff = {0} cm","kolonni koormusest või asendamisest, mis on seotud ristlõike takistusega b eff = {0} cm",null,null,null,null,null,null,"Ze zatížení podpor či příčníků, vztahuje se na odolnost příčného řezu b eff ="]
["tc_einzell9","Einzellast","Concentrated load","Carico singolo","Charge individuelle","Üksik koormus",null,null,null,null,null,null,"Zatížení"]
["tc_elasti","Elastische Anfangsdurchbiegung (in der charakteristischen Bemessungssituation)","Instantaneous elastic deflection (char. sit.)","Inflessione iniziale elastica (nella situazione di calcolo caratteristica)","Flèche initiale élastique (en situation de mesure caractéristique)","Elastne esialgne läbipaindumine (iseloomulikus projekteerimise olukorras)",null,null,null,null,null,null,"Elastické počáteční prohnutí (v charakteristické  situaci)"]
["tc_e-modu","E-Moduli","MOEs","Moduli E","Modules d'élasticité E","E-moodulid",null,null,null,null,null,null,"E moduly"]
["tc_enddur","Enddurchbiegung (in der quasiständigen Bemessungssituation)","Final deflection","Inflessione finale (nella situazione di calcolo quasi costante)","Flèche finale (en situation de mesure presque constante)","Lõplik läbipaindumine (peaaegu püsiva konstruktsiooni korral)",null,null,null,null,null,null,"Konečná deformace konstrukce "]
["tc_entspr","Entsprechend Zulassung wird angenommen, dass die Konstruktion bis zum Erreichen der Betonfestigkeit unterstützt ist oder gleichwertige Maßnahmen getroffen werden. ","According to the technical approval the construction is to be supported until the concrete reaches its load carrying capacity or similar measures are to be applied.","Secondo l'omologazione si presuppone che la costruzione venga sostenuta fino al raggiungimento della stabilità del cemento oppure che vengano adottate misure corrispondenti. ","Conformément à l'autorisation, on suppose que la construction est soutenue jusqu'à ce que la résistance du béton soit atteinte ou que des mesures équivalentes soient obtenues.","Vastavalt tüübikinnitusele eeldatakse, et konstruktsioon on toetatud kuni betooni tugevuse saavutamiseni või samaväärsete meetmete võtmiseni.",null,null,null,null,null,null,"Podle schválení se předpokládá, že struktura je podporována až do dosažení pevnosti betonu nebo v případě dosažení stejných rozměrů (opatření)."]
["tc_entspr20","Das Betongewicht führt folglich zu keinen zusätzlichen Spannungen im Holzquerschnitt.","Concrete weight therefore, does not lead to additonal stresses in the timber section.","Il peso del cemento non produce pertanto alcuna tensione ulteriore sulla sezione del legno.","Le poids du béton n'entraîne, par conséquent, aucune tension supplémentaire dans la coupe transversale du bois.","Betooni kaal ei põhjusta seega puidu ristlõikes täiendavaid pingeid.",null,null,null,null,null,null,"V důsledku toho hmotnost betonu nevede k dodatečnému napětí v průřezu dřeva."]
["tc_erf","erf","req","nec.","néc.","leiutas",null,null,null,null,null,null,"Požadováno"]
["tc_erf a","erf a","req.a","nec. a","néc a","leiutas",null,null,null,null,null,null,"Požadováno a"]
["tc_erf. a","erf. Achsabstand der Bewehrung von der Betonunterkante","Req. axial distance of reinforcement of the lower concrete edge","Interasse nec. dell'armatura dal bordo infer. del cemento","Entraxe néc. entre la barre d'armature et le bord inférieur en béton","erf. Betooni keskne kaugus betooni alumisest servast.",null,null,null,null,null,null,"Požadována osová vzdálenost výztuže od betonového spodního okraje"]
["tc_erf. p","erf. Plattendicke ","Req. Slab thickness","Spessore soletta nec.","Épaisseur néc. de la dalle ","erf. paneeli paksus",null,null,null,null,null,null,"Požadovaná tloušťka desky"]
["tc_erfb1","erforderliche Bewehrung unterschritten!","reinforcement lower than requierd","Armatura necessaria non raggiunta!","Armature nécessaire dépassée !","Tugevdamine jääb vajaka nõutavast!",null,null,null,null,null,null,"Výztuž nižší než je požadováno"]
["tc_erfb2","erforderliche Bewehrung abgedeckt","required reinforcement exists","Armatura necessaria coperta","Armature nécessaire couverte","Vajalik tugevdamine kaetud",null,null,null,null,null,null,"Požadováná výztuž odkryta"]
["tc_erfüll","erfüllte Deckenklasse","meets vibrationclass","Classe soletta realizzata","Catégorie de plafond remplie","täidetud lagi klass",null,null,null,null,null,null,"Splněná vibrační  třída desky"]
["tc_erh. d","Erh. der Kontaktlänge","Raise contact length","mantenimento lunghezza di contatto","Aug. de la longueur de contact","Kontaktpikkuse suurendamine",null,null,null,null,null,null,"Zvýšení  kontaktní délky"]
["tc_ersatz","Ersatzlast (fiktive Streckenlast)","Reference loading (respective linear load)","Carico equivalente (carico fittizio)","Charge de remplacement (charge linéaire fictive)","Asenduskoormus (fiktiivne liinikoormus)",null,null,null,null,null,null,"Umělá zátěž (fiktivní lineární zatížení)"]
["tc_ersatz4_","Ersatzlast für Schwinden (Beton-Kalender 2013, Kapitel: \"Holz-Beton-Verbund\", Punkt 7.1)","Reference loading for shrinkage (Beton-Kalender 2013)","Carico equivalente per ritiro (Beton-Kalender 2013, capitolo: \"Composto legno-cemento\", punto 7.1)","Charge de remplacement pour le retrait (Beton-Kalender 2013, chapitre : « Composite bois-béton », Point 7.1)","Ekvivalentne koormus kahanemise korral (Betoonikalender 2013, peatükk \"Puitbetoon-komposiit\", punkt 7.1)",null,null,null,null,null,null,"Umělá zátěž pro smrštění (Beton- kalendář 2013, kapitola: \"Dřevo-beton\", bod 7.1)"]
["tc_es sin","Es sind die Mindestabstände für Schrauben gemäß der folgenden Skizze zu beachten.","The minimum distances for screws according to the following drawing have to be considered.","Occorre prestare attenzione alle distanze minime per le viti secondo il disegno a seguire.","Les distances minimum entre les vis doivent être respectées conformément aux schémas suivants.","Järgmisel joonisel näidatud minimaalseid kruvide vahekaugusi tuleb järgida.",null,null,null,null,null,null,"Dbát na dodržování minimální vzdálenosti pro šrouby dle nákresu níže."]
["tc_f: ver","F: Verkehrs- und Parkfläche (leicht)","F: traffic and parking areas (light)","F: Superficie di traffico e di parcheggio (leggera)","F : surface de circulation et de parking (légère)","F: Liiklus- ja parkimisala (kerge)",null,null,null,null,null,null,"F: silnice a parkovací místo (lehké)"]
["tc_feders","Federsteifigkeit (einzelne Schraube)","Stiffness (single screw)","Rigidezza linguette (vite singola)","Rigidité de ressort (vis individuelle)","Vedru jäikus (üks kruvi)",null,null,null,null,null,null,"Tuhost pružiny (jednotlivý šroub)"]
["tc_feders1_","Federsteifigkeiten (für ","Stiffness (for ","Rigidezza linguette (per ","Rigidités de ressort (pour ","Vedru jäikus (puhul",null,null,null,null,null,null,"Tuhost pružiny (pro"]
["tc_fedst","Federsteifigkeiten (für {0} Verbindungsmittel nebeneinander)","Stiffness values (for {0} rows)","Rigidezza linguette (per (0) elementi di giunzione vicini)","Rigidités de ressort (pour {0} dispositif(s) d'assemblage l'un à côté de l'autre)","Vedru jäikus ({0} kinnitusdetailide puhul üksteise kõrval)",null,null,null,null,null,null,"Tuhost pružiny (pro {0} spojovací prostředky vedle sebe)"]
["tc_fläche","Flächen","Areas","Superfici ","Surfaces","Pinnad",null,null,null,null,null,null,"Plochy"]
["tc_fläche1","Fläche","area","Superficie","Surface","Pindala",null,null,null,null,null,null,"Plocha"]
["tc_fläche2_","Nutzlast / Mannlast","live load / man load","Carico utile / carico uomo","Charge Utile/Charge Humaine ","Kaskoormus / inimkoormus",null,null,null,null,null,null,"Užitečné zatížení / jednotlivé zatížení"]
["tc_form h","Form Holzquerschnitt","Shape of timber cross section","Forma sezione legno","Forme de la coupe de transversale en bois","Vormipuu ristlõige",null,null,null,null,null,null,"Tvar průřezu dřeva"]
["tc_für ","Für ","For","Per","Pour ","Sest",null,null,null,null,null,null,"pro"]
["tc_für 1m","Für 1m-Streifen","For 1 m width","Per strisce da 1m","Pour bandes de 1 m","1 m pikkuste ribade puhul",null,null,null,null,null,null,"Pro 1m pruhy","texte"]
["tc_für de","Für den Schwingungsnachweis verwendet:","Used for vibration design:","Utilizzato per la dimostrazione delle oscillazioni:","Utilisé(es) pour la preuve de vibration :","Kasutatakse vibratsioonianalüüsiks:",null,null,null,null,null,null,"Pro detekci vibrací použita:"]
["tc_g u,1","γ u,1","γ u,1","γ u,1","γ u,1","? u,1",null,null,null,null,null,null,"γ u,1"]
["tc_g u,2","γ u,2","γ u,2","γ u,2","γ u,2","? u,2",null,null,null,null,null,null,"γ u,2"]
["tc_g: ver","G: Verkehrs- und Parkfläche (mittel)","G: traffic and parking area (medium)","G: Superficie di traffico e di parcheggio (centro)","G : surface de circulation et de parking (moyenne)","G: Liiklus- ja parkimisala (keskmine)",null,null,null,null,null,null,"G: silnice a parkovací místa (střední)"]
["tc_gebrau","Gebrauchstauglichkeit (GZG)","Serviceability limit state (SLS)","Idoneità all'utilizzo (stato limite)","Aptitude à l'emploi (ELS)","Otstarbekohasus (GZG)",null,null,null,null,null,null,"Mezní stav použitelnosti"]
["tc_geford","geforderte Brandwiderstandsklasse:","Required fire-resistance","classe di resistenza alle fiamme richiesta:","Classe de résistance au feu exigée :","nõutav tulepüsivusklass:",null,null,null,null,null,null,"Požadovaná třída protipožární odolnosti"]
["tc_gelenk","gelenkig - gelenkig","hinge-hinge","articolato - articolato","souple - souple","liigendatud - liigendatud",null,null,null,null,null,null,"Sklopné - ohebné"]
["tc_geprüf","STATIK:","Checked by:","ESAMINATO:","Statique:","STATISTIKA:",null,null,null,null,null,null,"OVĚŘENÉ:"]
["tc_gesamt","Gesamtlänge der Schraube (Schraubenkopf außen bis Schraubenspitze außen)","Total length of the screw (outer screw head to screw tip)","Lunghezza totale della vite (dalla testa della vite esterna alla punta della vite esterna)","Longueur totale de la vis (tête de vis extérieure jusqu'à la pointe de la vis extérieure)","Kruvi kogupikkus (kruvipea väljastpoolt kuni kruvi otsani väljastpoolt)",null,null,null,null,null,null,"Celková délka šroubu (hlava šroubu vně k vnější špičce šroubu)"]
["tc_gew. m","gew. minimaler Abstand","Selected minimum distance","Distanza minima scelta","Distance minimum cho.","Min. kaugus",null,null,null,null,null,null,"Zvolená minimální vzdálenost"]
["tc_gew. m2_","gew. maximaler Abstand","Selected maximum distance","Distanza massima scelta","Distance maximum cho.","maksimaalne kaugus",null,null,null,null,null,null,"Zvolená  maximální vzdálenost"]
["tc_gewähl","Gewählter Schraubentyp","Selected screw-type","Tipo di vite scelta","Type de vis choisi","Valitud kruvitüüp",null,null,null,null,null,null,"Zvolený typ šroubu"]
["tc_gewähl1_","gewählte Bewehrung","Selected reinf.","Armatura scelta","Armature choisie","Valitud tugevdus",null,null,null,null,null,null,"Vybraná výztuž"]
["tc_gewich","Gewichtskraft einer auf der betrachteten Decke gehenden Person","Weight of a walking person","Forza peso di una persona che transita sulla soletta in questione","Poids d'une des personnes circulant sur le plafond observé","Vaatlusaluse lae peal kõndiva inimese kaalujõud",null,null,null,null,null,null,"Hmotnost osoby jdoucí po desce"]
["tc_gewind","Gewindelänge ","Thread length","Lunghezza filettatura","Longueur de filetage ","Niidi pikkus",null,null,null,null,null,null,"Délka závitu"]
["tc_gewind2_","Gewindelänge in QS2","Thread length in cross-section 2","Lunghezza filettatura in QS2","Longueur du filetage dans la CT2","Keermepikkus QS2-s",null,null,null,null,null,null,"Délka závitu v QS2 (průřez)"]
["tc_gewind3_","Gewindeaußendurchmesser ","Outer thread diameter","Diametro esterno filettatura","Diamètre extérieur du filetage ","Välimine niidi läbimõõt",null,null,null,null,null,null,"Vnější průměr závitu"]
["tc_gr","gr","lim","gr","gr","gr",null,null,null,null,null,null,"Limit"]
["tc_graphi","Graphische Darstellung der Schraubenausteilung","Graphics for screw positioning","Rappresentazione grafica della distribuzione delle viti","Représentation graphique de la répartition des vis","Kruvide vahekauguse graafiline kujutamine",null,null,null,null,null,null,"Grafické znázornění rozložení šroubů"]
["tc_größtm","Größtmögliche Enddurchbiegung (in der charakteristischen Bemessungssituation)","Maximum final deflection (char. situation)","Inflessione finale massima (nella situazione di dimensionamento caratteristica)","Flèche finale maximum (en situation de mesure caractéristique)","Maksimaalne võimalik lõplik läbipaine (iseloomulikus projekteerimisolukorras)",null,null,null,null,null,null,"Maximální konečná deformace konstrukce (v charakteristické návrhové situaci)"]
["tc_h: däc","H: Dächer","H: roofs","H: Tetti","H : toits","H: katused",null,null,null,null,null,null,"H: střechy"]
["tc_hallo","Hallo","Hello","Ciao","Bonjour","Tere",null,null,null,null,null,null,"ahoj"]
["tc_händle","HÄNDLER:","AGENT:","RIVENDITORE:","COMMERÇANT :","KAUBANDUS:",null,null,null,null,null,null,"Obchodník"]
["tc_haupts","Hauptspannrichtung","Main span direction","Direzione principale di serraggio","Sens principal de la contrainte","Peamine kinnitussuund",null,null,null,null,null,null,"Hlavní směr rozpětí"]
["tc_herst","Der Herstellprozess muß für den Tragfähigkeitsnachweis der Schrauben nicht berücksichtigt werden.","The influence of the building stages may be neglected for screw design.","Il processo di fabbricazione è trascurabile per la verifica della capacità di carico delle viti.","Le processus de fabrication n'a pas à être pris en compte pour la vérification de la charge ultime des vis.","Kruvide kandevõime kontrollimisel ei pea arvestama tootmisprotsessi."]
["tc_herst2","Der Schubfluss in der Verbundfuge wird inklusive Betonierlast am endgültigen System berechnet.\nDies entspicht der Annahme kontinuierlicher Unterstellung. Eine Reduktion der Unterstellungen reduziert den Schubfluss geringfügig.","Shear flow in the joint is calculated including concreting on final stage.\nThis is euqal to a continous  support at concreting. Reduction of supports reduces shear flow slightly.","Il flusso di taglio interno al giunto viene calcolato assieme al carico del calcestruzzo rispetto al sistema definitivo.Ciò corrisponde al presupposto di punti d’appoggio continui. Diminuendo i punti d’appoggio si ha una leggera riduzione del flusso di taglio.","Le flux de cisaillement à l'intérieur du joint est calculé en même temps que la charge du béton par rapport au système final, ce qui correspond à l'hypothèse de points d'appui continus. Si les points d'appui sont réduits, le flux de cisaillement est légèrement diminué.","Lõikevool sidusühenduses arvutatakse koos lõpliku süsteemi betoonikoormusega. Aluskihi vähendamine vähendab veidi nihkevoolu."]
["tc_höhe","Höhe","Height","Altezza","Hauteur","Kõrgus",null,null,null,null,null,null,"Výška"]
["tc_holz","Holz","Timber","Legno","Bois","Puit",null,null,null,null,null,null,"Dřevo"]
["tc_holzb","\"Holzbalkendecken und mechanisch verbundene Brettstapeldecken mit schwimmendem Estrich\" oder gleichwertig","\"Timber beam floor with mechanical fasteners or nail-laminated floors with floating screed\" or equivalent","\"Solai con travi in legno e solai con cataste di assi composte in modo meccanico con pavimento continuo flottante\" o similari","« Plafonds en poutres de bois et plafonds en planches de bois juxtaposées mécaniquement assemblées avec chape flottante » ou équivalents","\"Puitpalklaed ja mehaaniliselt ühendatud laudisega laed koos ujuvkattega\" või samaväärne.",null,null,null,null,null,null,"Trámové desky a mechanicky spojené prkenné desky s plovoucí podlahou či rovnocenné"]
["tc_holzqu","Holzquerschnitt","Timber section","Sezione legno","Coupe transversale du bois","Puidu ristlõige",null,null,null,null,null,null,"Průřez dřeva"]
["tc_i eig,","I eig,1","I indiv,1","I prop.,1","I pro,1","I eig,1",null,null,null,null,null,null,"I vlastní, 1"]
["tc_i eig,2_","I eig,2","I indiv,2","I prop.,2","I pro,2","I eig,2",null,null,null,null,null,null,"I vlastní, 2"]
["tc_imTraeger","im Trägerinneren (siehe Querkraftdeckung)","between supports (see shear resistance)","tra le travi (vedere la resistenza alla forza di tagio)","à l'intérieur du support (voir couverture de la force transversale)","tala sees (vt nihkevõime kate)",null,null,null,null,null,null,"Mezi podpěrami (viz smyková odolnost)"]
["tc_indie"," in die "," in the ","Nella  "," dans la/les "," sisse",null,null,null,null,null,null," v"]
["tc_inform","informativ","Informative","Informativo","à titre informatif","informatiivne",null,null,null,null,null,null,"Informativní"]
["tc_inholz"," in den Holzteil","timber beam","Nella parte in legno"," dans la pièce de bois"," puidust osa",null,null,null,null,null,null,"V dřevěné  části"]
["tc_ja","ja","yes","Sì","oui","Jah",null,null,null,null,null,null,"ano"]
["tc_k def,","k def,gesamt","k def, tot","K def, totale","k def,total","k def,kokku",null,null,null,null,null,null,"k def celkově"]
["tc_k mod","k mod","k mod","k mod","k mod","k mod",null,null,null,null,null,null,"K mod"]
["tc_k ser","K ser","K ser","K ser","K ser","K ser",null,null,null,null,null,null,"Kser"]
["tc_k ser,","K ser, einzel","K ser, indiv.","K ser, singolo","K ser, individuel","K ser, ühekordne",null,null,null,null,null,null,"K ser, samostatně"]
["tc_k u","K u","K u","K u","K u","K u",null,null,null,null,null,null,"K u"]
["tc_k u, e","K u, einzel","K u, indiv.","K u, singolo","K u, individuel","K u, ühekordne",null,null,null,null,null,null,"K u, samostatně"]
["tc_katego","Kategorie / Beispiel","Category / Example","Categoria / esempio","Catégorie / exemple","Kategooria / Näide",null,null,null,null,null,null,"Kategorie / Příklad"]
["tc_konmindb","konstruktive Mindestbreite von 5 cm","Constructive minimum width of 5 cm","Larghezza costruttiva minima di 5 cm","Largeur minimum de construction de 5 cm","konstruktiivne minimaalne laius 5 cm",null,null,null,null,null,null,"Konstruktivní minimální šířka 5 cm"]
["tc_kurzau","Kurzausgabe - Zusammenfassung der Ergebnisse","Results in brief","Versione breve - riassunto dei risultati","Édition abrégée - résumé des résultats","Lühiväljaanne - tulemuste kokkuvõte",null,null,null,null,null,null,"Zkrácená verze - Souhrn výsledků"]
["tc_l beto","l Beton","l concr.","I Cemento","l béton","l Betoon",null,null,null,null,null,null,"l beton"]
["tc_l ef","l ef","l ef","I ef","l ré","l ef",null,null,null,null,null,null,"l ef"]
["tc_l ges","l ges","l tot","I tot.","l est","l kokku",null,null,null,null,null,null,"l m."]
["tc_l gew","l Gew","l thread","I peso","l fil","l Kaal",null,null,null,null,null,null,"l hmotnost"]
["tc_l holz","l Holz","l tmbr.","I Legno","l bois","l Puit",null,null,null,null,null,null,"l dřevo"]
["tc_l r","l R","l R","I R","l R","l R",null,null,null,null,null,null,"l R"]
["tc_lageru","Lagerungsbedingungen","Bearing conditions","Condizioni di supporto","Conditions de stockage","Ladustamistingimused",null,null,null,null,null,null,"Skladovací podmínky"]
["tc_länge ","Länge der Schraube im Beton (l ges - l ef - l R)","Length of screw in concrete (l ges - l ef - l R)","Lunghezza della vite nel cemento (I tot. - I ef - I R)","Longueur de la vis dans le béton (l est - l ré + l R)","Kruvi pikkus betoonis (l ges - l ef - l R)",null,null,null,null,null,null,"Délka šroubu v betonu (l m - l ef - l R)"]
["tc_lastzu","Lastzusammenstellung - Lastfallkombinationen","Load combinations","Composizione carico - combinazioni cadute  carico","Assemblage des charges - combinaisons de cas de charge","Koormuse koostis - koormuskombinatsioonid",null,null,null,null,null,null,"Poslední kompilace - kombinace zatížení"]
["tc_lt. al","lt. allg. bauaufsichtlicher Zulassung","according to approval","Ai sensi dell'Omologazione dell'ispettorato lavori edili","d'ap. l'agrément technique géné.","vastavalt üldisele ehitusinspektsiooni heakskiidule",null,null,null,null,null,null,"Všeobecné stavební  schválení - kolaudace "]
["tc_-lt. q","-lt. QS-Angaben-","-see section definition -","Secondo i dati QS","-d'ap. les données de CT-","-lt. QS andmed-",null,null,null,null,null,null,"viz údaje (sekce)"]
["tc_m 1,d","M 1,d","M 1,d","M 1,d","M 1,d","M 1,d",null,null,null,null,null,null,"M 1, d"]
["tc_m 2,d","M 2,d","M 2,d","M 2,d","M 2,d","M 2,d",null,null,null,null,null,null,"M 2, d"]
["tc_m d","M d","M d","M d","M d","M d",null,null,null,null,null,null,"M d"]
["tc_m ed,s","M Ed,s1","M Ed,s1","M ed, s1","M Ed,s1","M Ed,s1",null,null,null,null,null,null,"M Ed, S1"]
["tc_mannl5","Mannlast Qk für Querbiegung:","Man load Qk for transverse bending:","Carico manuale Qk per flessione trasversale","Charge humaine Qk pour courbure transversale :","Inimkoormus Qk põikitõmbeks:",null,null,null,null,null,null,"Zatížení Qk pro příčný ohyb"]
["tc_maßg","maßg","decsv.","det.","déci","kohandatud",null,null,null,null,null,null,"Směrodatné"]
["tc_maßgeb","maßgebende Kombination","Decisive combination","Combinazione determinante","Combinaison décisive","Asjakohane kombinatsioon",null,null,null,null,null,null,"Směrodatná kombinace"]
["tc_maßgeb1_","maßgebende Querkraft im Abstand h2 vom Auflager","Effective shear force at a distance of h2 from support","Forza di taglio determinante nella distanza h2 dall'appoggio","Force transversale décisive avec une distance h2 avec l'appui","otsustav nihkevõime kaugusele h2 toetusest",null,null,null,null,null,null,"Směrodatná boční síla v h2 vzdálenost od podpory"]
["tc_maßgeb2_","Maßgebender Schubspannungsnachweis:","Decisive shear limit state:","Dimostrazione det. della tens. di spinta ","Preuve de cont. de cisaillement décisive :","Autoriteetne nihkepinge kontrollimine:",null,null,null,null,null,null,"Směrodatné smykové napětí:"]
["tc_maßgeb3","maßgebend","decisive","determinante","décisif(ve)","autoriteetne",null,null,null,null,null,null,"Směrodatné"]
["tc_materi","Material ","Material","Materiale","Matériau ","Materjal",null,null,null,null,null,null,"Materiál"]
["tc_materi2_","MATERIALQUALITÄTEN:","MATERIAL VALUES:","Qualità del materiale","QUALITÉS DU MATÉRIAU :","MATERJALI OMADUSED:",null,null,null,null,null,null,"Vlastnosti materiálu:"]
["tc_materi3_","Material Schalung:","Material of formwork:","Materiale casseforme","Matériau du coffrage :","Šablooni materjal:",null,null,null,null,null,null,"Materiál bednění:"]
["tc_max","max","max","max","max","max",null,null,null,null,null,null,"max"]
["tc_menü","MENÜ","MAIN MENU","MENU","MENU","MENU",null,null,null,null,null,null,"MENU"]
["tc_min","min","min","min","min","min",null,null,null,null,null,null,"min"]
["tc_mindes","Mindestwert der ersten Eigenfrequenz","Required frequency limit","Valore minimo della prima frequenza propria","Valeur minimum de la première fréquence propre","Esimese loodussageduse miinimumväärtus",null,null,null,null,null,null,"Minimální hodnota první frekvence"]
["tc_mitwir","mitwirkende Breite (nach Gleichung NA. 7.2-E3)","Effective width (NA. 7.2-E3)","Larghezza concorrente  (secondo equazione NA. 7.2-E3)","Largeur qui participe (conformément à l'équation FA. 7.2-E3)","Kaasnev laius (vastavalt võrrandile NA. 7.2-E3)",null,null,null,null,null,null,"Účinná šířka (podle rovnice NA. 7,2-E3)"]
["tc_modale","modaler Dämpfungsgrad (Lehr'sches Dämpfungsmaß) laut Tabelle NA. 7.6","Modal damping as in table NA. 7.6","grado di smorzamento modale (massa di smorzamento ) conformemente alla Tabella NA. 7.6","Taux d'amortissement modal (affaiblissement) d'après le tableau FA. 7.6","modaalne summutussuhe (Lehri summutussuhe) vastavalt tabelile NA. 7.6",null,null,null,null,null,null,"Modální stupeň tlumení   podle tabulky NA. 7.6"]
["tc_modale1_","Modale Masse","Modal mass","Massa modale","Masse modale","Modaalne mass",null,null,null,null,null,null,"Modální hmota"]
["tc_mraum","m Raumbreite","m room width","m Larghezza locale","m largeur de la pièce","m ruumi laius",null,null,null,null,null,null,"m šířka prostoru"]
["tc_n 1,d","N 1,d","N 1,d","N 1,d","N 1,d","N 1,d",null,null,null,null,null,null,"N 1, d"]
["tc_n 2,d","N 2,d","N 2,d","N 2,d","N 2,d","N 2,d",null,null,null,null,null,null,"N 2, d"]
["tc_na    ","NA    Wohngebäude","NA    residential buildings","NA Complesso abitativo","FA    immeuble d'habitation","NA Eluhooned",null,null,null,null,null,null,"NA obytné budovy"]
["tc_nach o","nach EN 1992-1-1, Punkt 3.1.6 (1) ","according to EN 1992-1-1, Punkt 3.1.6 (1) ","Ai sensi della EN 1992-1-1, punto 3.1.6 (1)","conformément àEN 1992-1-1, Point 3.1.6 (1) ","vastavalt standardi EN 1992-1-1 punktile 3.1.6 (1)",null,null,null,null,null,null,"podle EN 1992-1-1, bod 3.1.6 (1)"]
["tc_nachwe","Nachweise quer zur Spannrichtung der Decke","Design perpendicular to the main span","Dimostrazioni trasversalmente alla direzione di fissaggio della soletta","Preuves en travers du sens de la contrainte du plafond","Kontrollimine risti lae sirgumise suunaga",null,null,null,null,null,null,"Ověření - příčně ke směru hlavního rozpětí"]
["tc_nachwe10_","Nachweis b)","Verification b)","Dimostrazione b)","Preuve b)","Tõend b)",null,null,null,null,null,null,"Ověření b)"]
["tc_nachwe11","Nachweis nicht erforderlich, da Frequenzkriterium (1) erfüllt ist","verification not requied, because frequency criterion (1) is met","Dimostrazione non necessaria, dato che il criterio di frequenza (1) è realizzato","Preuve non nécessaire, car le critère de fréquence (1) est rempli","Tõendamist ei nõuta, kuna sageduskriteerium 1 on täidetud.",null,null,null,null,null,null,"Ověření není není požadováno, protože kritérium frekvence  je splněno"]
["tc_nachwe2_","Nachweise im Grenzzustand der Tragfähigkeit","Ultimate limit state design","Dimostrazioni nella condizione limite della portata","Preuves à l'état limite de la force portante","Kontrollimine lõplikus piirseisundis",null,null,null,null,null,null,"Ověření v mezním stavu nosnosti"]
["tc_nachwe3_","Nachweis der Gebrauchstauglichkeit (nach EN 1995-1-1:2014, Punkt 7)","Verification of serviceability limit states (EN 1995-1-1:2014, Punkt 7)","Dimostrazione dell'idoneità all'uso (ai sensi di EN 1995-1-1:2014, punto 7)","Preuve de l'aptitude à l'emploi (conformément à EN 1995-1-1 : 2014, Point 7)","Kasutuskõlblikkuse tõendamine (vastavalt EN 1995-1-1:2014, punkt 7)",null,null,null,null,null,null,"Ověření běžné provozuschopnosti (dle  EN 1995-1-1: 2014, bod 7)"]
["tc_nachwe4_","Nachweise im Grenzzustand der Gebrauchstauglichkeit (nach ON NA.AT)","Serviceability limit state design (according to Austrian Standards)","Dimostrazione nella condizione limite dell'idoneità all'uso (ai sensi della ON NA.AT)","Preuves à l'état limite de l'aptitude à l'emploi (conformément à ON FA.AT)","Kontrollimine kasutuskõlblikkuse piirseisundis (vastavalt ON NA.AT)",null,null,null,null,null,null,"Ověření mezního stavu provozuschopnosti (podle ON NA.AT)"]
["tc_nachwe5_","Nachweis in Plattenquerrichtung  (nach EN 1992-1-1)","Verification in cross direction (EN 1992-1-1)","Dimostrazione nella direzione trasversale della soletta (ai sensi della EN 1992-1-1)","Preuve dans le sens transversal de la dalle (conformément à EN 1992-1-1)","Tõendamine plaadi põiksuunas (vastavalt standardile EN 1992-1-1-1)",null,null,null,null,null,null,"Ověření  v příčném směru (EN 1992-1-1)"]
["tc_nachwe6_","Nachweis Biegung","Verification of bending","Dimostrazione flessione","Preuve de flexion","Painutamise tõendamine",null,null,null,null,null,null,"Ověření prohybu"]
["tc_nachwe7_","Nachweise der Tragfähigkeit im Brandfall","Fire design","Dimostrazioni della portata in caso di incendio","Preuves de la force portante en cas d'incendie","Tõend kandevõime kohta tulekahju korral",null,null,null,null,null,null,"Ověření odolnosti v případě požáru"]
["tc_nachwe8_","Nachweis a1)","Verification a1)","Dimostrazione a1)","Preuve a1)","Tõend a1)",null,null,null,null,null,null,"Ověření a1)"]
["tc_nachwe9_","Nachweis a2)","Verification a2)","Dimostrazione a2)","Preuve a2)","Tõend a2)",null,null,null,null,null,null,"Ověření a2)"]
["tc_nb    ","NB    Büroflächen","NB    office areas","NB Superfici adibite ad uffici","CB    surfaces de bureau","NB Kontoriruumid",null,null,null,null,null,null,"NB kancelářské prostory"]
["tc_nc    ","NC    Schulen, Cafés…","NC    schools, cafés…","NC Scuole, bar…","CC    écoles, cafés...","NC koolid, kohvikud",null,null,null,null,null,null,"NC školy, kavárny ..."]
["tc_nd    ","ND    Verkaufsflächen","ND    sales areas","ND Superfici commerciali","CD    surfaces de vente","ND Jaemüügipinnad",null,null,null,null,null,null,"ND prodejní plochy"]
["tc_ne    ","NE    Lagerflächen, Stallungen","NE    storage areas, stables","NE Magazzini, stalle","CE    surfaces de stockage, bâtiments d'élevage","NE Ladustamisalad, tallid",null,null,null,null,null,null,"NE skladovací prostory, stáje"]
["tc_nein","nein","no","No","non","ei",null,null,null,null,null,null,"ne"]
["tc_neubau","Neubau","New building","Nuova costruzione","Nouvelle construction","Uus hoone",null,null,null,null,null,null,"Novostavba"]
["tc_nf    ","NF    Verkehrs- Parkflächen","NF    traffic and parking areas","NF Superfici dadibite al traffico - al parcheggio","CF    surfaces de circulation - de parking","NF Traffic parklad",null,null,null,null,null,null,"NF dopravní parkovací plochy"]
["tc_ng    ","NG    Verkehrs- Parkflächen","NG    traffic and parking areas","NG Supefici adibite al traffico - al parcheggio","CG    surfaces de circulation - de parking","NG Liiklus - Parkimisalad",null,null,null,null,null,null,"NG dopravní parkovací plochy","."]
["tc_nh    ","NH    nicht zugängliche Dächer","NH    inaccessible roofs","Tetti non accessibili","CH    toits non accessibles","NH mittejuurdepääsetavad katused",null,null,null,null,null,null,"NH nepřístupné střechy"]
["tc_nkl 1:","NKL 1: Innenräume von Wohn-, Schul- und Verwaltungsbauten","SC 1: Interior rooms of residential, school- and administrative buildings","Classe d'utilizzo 1: Spazi interni di edifici residenziali, scolastici e amministrativi","CDS 1 : intérieurs d'immeubles d'habitation, scolaires et administratifs","NKL 1: Elamute, koolide ja administratiivhoonete siseruumid",null,null,null,null,null,null,"NKL 1: interiéry obytných, školních a kancelářských budov"]
["tc_nkl 2:","NKL 2: Innenräume von Nutzbauten wie Lagerhallen, Reithallen und Industriehallen sowie überdachte Konstruktionen im Freien, deren Bauteile nicht der freien Bewitterung  ausgesetzt sind (Regeneinfallswinkel ≤ 30°)","SC 2: Interior rooms of buildings such as storage buildings, riding halls and industrial buildings as well as roofed constructions outdoor, whose members are not weathered  (Rain angle ≤ 30°)","Classe d'utilizzo 2: Spazi interni di fabbricati come magazzini, centri ippici e capannoni industriali come pure costruzioni all'aperto coperte, i cui componenti non sono esposti alle intemperie (angolo incidenza pioggia ≤ 30°)","CDS 2 : intérieurs de constructions fonctionnelles comme les hangars de stockage, les manèges couverts et les hangars industriels ainsi que les constructions couvertes à l'air libre, dont les éléments ne sont pas soumis aux intempéries (angle d'incidence de la pluie ≤ 30°)","NKL 2: üldkasutatavate hoonete, nagu laohoonete, ratsahallide ja tööstushallide siseruumid, samuti katusega välitingimustes olevad konstruktsioonid, mille osad ei ole ilmastikutingimustele avatud (vihma langemisnurk = 30°).",null,null,null,null,null,null,"NKL 2: interiéry komerčních budov, jako jsou sklady, jízdárny, průmyslové haly a kryté venkovní stavby, jejichž složky nejsou vystaveny povětrnostním vlivům (déšť - úhel ≤ 30 °)"]
["tc_normal","Normalspannungen Holz","Timber normal stresses","Tensioni normali legno","Contraintes normales du bois","Normaalsed pinged puit",null,null,null,null,null,null,"Normální napětí dřeva"]
["tc_normal1_","Normalspannungen Holz","Timber normal stresses","Tensioni normali legno","Contraintes normales du bois","Normaalsed pinged puit",null,null,null,null,null,null,"Normální napětí dřeva"]
["tc_normal2_","Normalspannungen","Normal stresses","Tensioni normali","Contraintes normales","Tavalised pinged",null,null,null,null,null,null,"Normální napětí"]
["tc_nutzla","Nutzlastkategorie:","Live load category:","Categoria carico utile:","Catégorie de charge utile :","Kaskoormuse kategooria:",null,null,null,null,null,null,"Kategorie užitečného zatížení:"]
["tc_nutzla2_","Nutzlast nk:","Live load nk:","Carico utile nk:","Charge utile nk :","Kaskoormus nk:",null,null,null,null,null,null,"Užitečné zatížení nk:"]
["tc_nutzla3__","Nutzlast","Live load","Carico utile","Charge utile","Kaskoormus",null,null,null,null,null,null,"Užitečné zatížení"]
["tc_nutzla4_","Nutzlastkategorien laut EN 1991-1-1:","Live load category (EN 1991-1-1):","Categorie carico utile ai sensi della EN 1991-1-1","Catégories de charge utile conformément à EN 1991-1-1 :","Kasutuskoormuse kategooriad vastavalt standardile EN 1991-1-1:",null,null,null,null,null,null,"Kategorie užitečného zatížení: podle EN 1991-1-1:"]
["tc_nutzlan10","Nutzlastanteil Nk:","Live load Nk:","Percentuale carico utile Nk:","Proportion de la charge utile Nk :","Kaskoormuse osa Nk:",null,null,null,null,null,null,"Užitečné zatížení - podíl: Nk:"]
["tc_nutzun","Nutzungsklasse:","Service class:","Classe utilizzo:","Catégorie d'utilisation :","Kasutusklass:",null,null,null,null,null,null,"Třída:"]
["tc_nutzun1_","Nutzungsklasse laut ÖNORM EN 1995-1-1","Service class (according to EN 1995-1-1):","Classi utilizzo ai sensi della ÖNORM EN 1995-1-1","Catégorie d'utilisation conformément à ÖNORM EN 1995-1-1","Kasutusklass vastavalt ÖNORM EN 1995-1-1.",null,null,null,null,null,null,"Třídy podle  EN 1995-1-1"]
["tc_osb","OSB","OSB","OSB","OSB","OSB",null,null,null,null,null,null,"OSB"]
["tc_owg1","ohne w g1,inst = {0} mm","without w g1,inst = {0} mm","sensa w g1,inst = {0} mm","sans w g1,inst = {0} mm","ilma w g1,inst = {0} mm",null,null,null,null,null,null,"bez w g1,inst = {0} mm"]
["tc_platte","Platte / Dippelbaumdecke","Slab / dowel beams","Soletta / solaio con travi maschiate","Dalle / plafond en poutres","Plaat / dipple tree cover",null,null,null,null,null,null,"Deska /hmoždinky - trámy"]
["tc_platte1_","Platte / Dippelbaumdecke","Slab / dowel beams","Soletta / solaio con travi maschiate","Dalle / plafond en poutres","Plaat / dipple tree cover",null,null,null,null,null,null,"Deska /hmoždinky - trámy"]
["tc_platte2","Brettsperrholz (BSP)","Cross-Laminated-Timber (CLT)","XLAM","XLAM","Ristkihtpuit (CLT)",null,null,null,null,null,null,"XLAM"]
["tc_pos. n","POS. NR.:","POS. NO.:","POS. N.:","POS. N° :","POS. NO.:",null,null,null,null,null,null,"poz.číslo"]
["tc_pos.nr","Pos.Nr.:","Pos. No.:","Pos.N.:","Pos. n° :","Artikli nr:",null,null,null,null,null,null,"poz.číslo"]
["tc_q d","q d","q d","q d","q d","q d"]
["tc_q ef,k","Q ef,k","Q ef,k","Q ef,k","Q ef,k","Q ef,k"]
["tc_qs1, b","QS1, Beton","QS1, concrete","QS1, Cemento","CT1, béton","QS1, betoon",null,null,null,null,null,null,"QS1, beton"]
["tc_qs2, h","QS2, Holz","QS2, timber","QS2, Legno","CT2, bois","QS2, puit",null,null,null,null,null,null,"QS2, dřevo"]
["tc_qskalt","Querschnitt kalt {0}/{1}","Cross-section cold {0}/{1}","Sezione fredda (0)/(1)","Coupe transversale à froid {0}/{1}","Külm ristlõige {0}/{1}",null,null,null,null,null,null,"Příčný řez za studena {0} / {1}"]
["tc_qsred","Reduzierter Querschnitt {0}/{1}","Reduced section {0}/{1}","Sezione ridotta {0}/{1}","Coupe transversale réduite {0}/{1}","Vähendatud ristlõige {0}/{1}",null,null,null,null,null,null,"Snížený průřez {0} / {1}"]
["tc_quasi-","Quasi-ständige Bemessungssituation","Quasi permanent design situation","Situazione di dimensionamento quasi costante","Situation de mesure presque constante","Kvaasi-püsiv dimensioneerimise olukord",null,null,null,null,null,null,"Kvazi-stálá konstrukce"]
["tc_qudeck","Querkraftdeckung (t={0})","Stress vs. Resistance in Screws (t={0})","Copertura della forza di taglio (t={0})","Couverture de la force transversale (t={0})","Lõikevõime katmine (t={0})",null,null,null,null,null,null,"Smyková síla pokrytí (t={0})"]
["tc_querkr","Querkraft","Shear force","Forza di taglio","Force transversale","Nihkejõud",null,null,null,null,null,null,"Boční síla"]
["tc_querkr2_","Querkrafttragfähigkeit der Betonplatte","Shear resistance of the concrete slab","Portata forza di taglio della soletta in cemento","Force portante transversale de la dalle en béton","Betoonplaadi nihkevõime kandevõime",null,null,null,null,null,null,"Smyková únosnost betonové desky"]
["tc_querri","Querrichtung Platte","Slab cross direction","Direzione trasversale della soletta","Sens transversal de la dalle","Põikisuunaline plaat",null,null,null,null,null,null,"Příčná deska"]
["tc_quersa","Querschnitt abgebrannt","Burned section","Sezione bruciata","Coupe transversale incendiée","Põlenud ristlõige",null,null,null,null,null,null,"Příčný řez(průřez) - ohořelý"]
["tc_quersc","QUERSCHNITT:","CROSS-SECTION:","SEZIONE:","COUPE TRANSVERSALE :","RISTLÕIKAMINE:",null,null,null,null,null,null,"Příčný řez (průřez):"]
["tc_quersc2_","Querschnittswerte nach dem γ-Verfahren (nach EN 1995-1-1:2014, Anhang B)","Cross section values according to γ-Method (EN 1995-1-1:2014, Appendix B)","Valori sezione secondo il metodo γ (ai sensi della EN 1995-1-1:2014, Appendice B)","Valeurs de la coupe transversale d'après la méthode γ (conformément à EN 1995-1-1 : 2014, Annexe B)","ristlõike väärtused vastavalt ?-meetodile (vastavalt EN 1995-1-1:2014, lisa B)",null,null,null,null,null,null,"Hodnoty průřezu podle y-metody (podle normy EN 1995-1-1: 2014, příloha B)"]
["tc_quersc3_","Querschnittswerte","Cross section values","Valori sezione  ","Valeurs de la coupe transversale","Läbilõike väärtused",null,null,null,null,null,null,"Hodnoty příčného řezu (průřezu)"]
["tc_quersc4_","Querschnittswerte nach dem γ-Verfahren (nach EN 1995-1-1:2014, Anhang B)","Cross section values accordig to γ-Method (EN 1995-1-1:2014, Appendix B)","Valori sezione secondo il metodo γ (ai sensi della EN 1995-1-1:2014, Appendice B)","Valeurs de la coupe transversale d'après la méthode γ (conformément à EN 1995-1-1 : 2014, Annexe B)","ristlõike väärtused vastavalt ?-meetodile (vastavalt EN 1995-1-1:2014, lisa B)",null,null,null,null,null,null,"Hodnoty příčného řezu (průřezu) podle y-metody (podle normy EN 1995-1-1: 2014, příloha B)"]
["tc_quersc5","Querschnitt","Cross section","Sezione","Coupe transversale","Läbilõige",null,null,null,null,null,null,"Příčný řez (průřez):"]
["tc_querve","Querverteilung","Cross distribution","Distribuzione trasversale","Répartition transversale","Ristjaotus",null,null,null,null,null,null,"Příčné rozdělení"]
["tc_rand","Rand","edge","Bordo","Limite","Edge",null,null,null,null,null,null,"Okraj"]
["tc_randsp","Randspannungen","Edge stresses","Tensioni sul bordo","Contraintes aux limites","Serva pinged",null,null,null,null,null,null,"Krajní napětí"]
["tc_raumti","Raumtiefe b:","Room depth b:","Profondità locale b:","Profondeur de la pièce b :","Ruumi sügavus b:",null,null,null,null,null,null,"Hloubka prostoru  b:"]
["tc_rechne","rechnerische Gewindelänge ","Calculational thread length","Lunghezza filettatura calcolata","Longueur de filetage calculée ","Arvutatud niidi pikkus",null,null,null,null,null,null,"Výpočtová délka závitu"]
["tc_reduzi","Reduzierter Querschnitt","Reduced cross section","Sezione ridotta","Coupe transversale réduite","Vähendatud ristlõige",null,null,null,null,null,null,"Snížený průřez"]
["tc_reipro1","{0} {1} pro 1-m Plattenstreifen, {2} Gesamtanzahl: {3} Stk.","{0} {1} per 1-m plate section, {2} total number: {3} pcs.","{0} {1} per strisce di 1 m, {2} numero totale: {3} pz.","{0} rangée(s) par bandes de dalle de 1 m, {1} nombre total : {2} pcs.","{0} {1} 1 m paneeliriba kohta, {2} koguarv: {3} tk.",null,null,null,null,null,null,"{0} Řady na úsek desky 1m, {1} Celkový počet: {2} kusů."]
["tc_reipro2","{0} Reihe {1}, {2} Gesamtanzahl: {3} Stk.","{0} row {1}, {2} total number: {3} pcs.","{0} serie {1}, {2} numero totale: {3} pz.","{0} {1} rangée, nombre total : {2} pcs.","{0} Rida {1}, {2} Koguarv: {3} tk.",null,null,null,null,null,null,"{0} {1} Řady,  Celkový počet: {2} kusů."]
["tc_reiprot","{0} {1} pro Tram, {2} Gesamtanzahl: {3} Stk.","{0} {1} per beam, {2} total number: {3} pcs.","{0} {1} per trave principale, {2} numero totale: {3} pz.","{0} rangée(s) par trame, {1} nombre total : {2} pcs.","{0} {1} trammi kohta, {2} koguarv: {3} tk.",null,null,null,null,null,null,"{0} Řady na trám, {1} Celkem: {2} kusy"]
["tc_reiprotL","Reihen","rows","Serie","Rangées","Rid"]
["tc_reiprotX","Kreuzreihen","cross-rows","X-Serie","Rangées X","Ristsirged"]
["tc_rho k(sc","ρ k(Schalung)","ρ k(formwork)","ρ k (casseforme)","ρ k(coffrage)","? k(šabloon)",null,null,null,null,null,null,"ρ k (bednění)"]
["tc_rho_ beto","ρ Beton","ρ concrete","ρ Cemento","ρ béton","? Betoon",null,null,null,null,null,null,"ρ beton"]
["tc_s ef","s ef","s ef","s ef","s ré","s ef",null,null,null,null,null,null,"s ef"]
["tc_s läng","s längs","s long","s long.","s longi","s pikisuunas",null,null,null,null,null,null,"s délka"]
["tc_s max","s max","s max","s max","s max","s max",null,null,null,null,null,null,"s max"]
["tc_s min","s min","s min","s min","s min","s min",null,null,null,null,null,null,"s min"]
["tc_s min ","s min = ","s min = ","s min = ","s min = ","s min =",null,null,null,null,null,null,"s min ="]
["tc_s quer","s quer","s perp","s trasversale","s tran","s põikisuunaline",null,null,null,null,null,null,"s příčně"]
["tc_schnit","Schnittgrößenermittlung","Calculation of internal forces","Rilevamento grandezze taglio","Calcul de la taille de coupe","Sisemiste jõudude määramine",null,null,null,null,null,null,"Výpočet síly"]
["tc_schnit2_","Schnittgrößen bezogen auf die Querschnittsteile","Internal forces in cross section parts","Grandezze taglio riferite ai componenti della sezione trasversale","Tailles de coupe relatives aux portions de coupe transversale","Sisejõud, mis on seotud ristlõike osadega",null,null,null,null,null,null,"Síly v příčných částech"]
["tc_schnit3_","Schnittgrößen","Internal forces","Grandezze taglio","Tailles de coupe","Sisemised jõud",null,null,null,null,null,null,"Síly"]
["tc_schra2","Schraubenposition","Screw position","Posizione delle viti","Position des vis","Kruvi asend",null,null,null,null,null,null,"Pozice šroubu"]
["tc_schrau","Schrauben - Ausnutzung der Tragfähigkeit","Screws - capacity utilisation","Viti - Sfruttamento della portata","Vis - utilisation de la force portante","Kruvid - kandevõime kasutamine",null,null,null,null,null,null,"Šrouby - využití nosnosti"]
["tc_schrau1_","Schrauben gesamt","total screws","Viti totali","Total des vis","Kruvid kokku",null,null,null,null,null,null,"Celkový počet šroubů"]
["tc_schrau2_","Schrauben pro m²","Screws per m²","Viti per m²","Vis par m²","Kruvid m² kohta",null,null,null,null,null,null,"Šrouby na m²"]
["tc_schubf","Schubfluss in der Fuge","Shear flow in joint","Flusso di spinta nella giunzione","Flux de cisaillement dans le joint","Lõikevool liigendis",null,null,null,null,null,null,"Smykový tok v drážce"]
["tc_schubs","Schubspannung","Shear stress","Tensione tangenziale","Contrainte de cisaillement","Nihkepinge",null,null,null,null,null,null,"Smykové napětí"]
["tc_schubs2_","Schubspannungen","Shear stresses","Tensioni tangenziali","Contraintes de cisaillement","Nihkepinged",null,null,null,null,null,null,"Smyková napětí"]
["tc_schubs3_","Schubspannungsnachweis","Shear verification","Comprova della tensione tangenziale","Preuve de contrainte de cisaillement","Nihkepinge kontrollimine",null,null,null,null,null,null,"Ověření smykového napětí"]
["tc_schubt","Schubtragfähigkeit","Shear capacity","Portata spinta","Résistance au cisaillement","Survekoormuse kandevõime",null,null,null,null,null,null,"Kapacita smyku"]
["tc_schwer","Schwerpunktslage","Position of centre of gravity","Posizione baricentro","Position du centre de gravité","Gravitatsioonikeskus",null,null,null,null,null,null,"Poloha těžiště"]
["tc_schwer2_","Schwerpunktsspannungen","Stresses in the CG","Tensioni baricentro","Contraintes du centre de gravité","Raskuskeskme pinged",null,null,null,null,null,null,"Napětí v těžišti"]
["tc_schwi2","Schwingungsnachweis (ausblenden)","Vibration design (hide)","Dimostrazione oscillazioni (mascherare)","Preuve de vibration (masquer)","Vibratsioonianalüüs (varjata)",null,null,null,null,null,null,"Detekce vibrací (skrytí)"]
["tc_schwi3","Schwingungsnachweis (einblenden)","Vibration design (show)","Dimostrazione oscillazioni (mostrare)","Preuve de vibration (afficher)","Vibratsioonianalüüs (sisseviimine)",null,null,null,null,null,null,"Detekce vibrací (odkrytí)"]
["tc_schwin","Schwingungsnachweis","Vibration design","Dimostrazione oscillazioni","Preuve de vibration","Vibratsiooni kontrollimine",null,null,null,null,null,null,"Ověření vibrace"]
["tc_sdiagr","s {0}= {1} cm\n(entspr. {2} Stk.)\nF R,d = {3} kN","s {0}= {1} cm\n(equiv. {2} Pcs.)\nF R,d = {3} kN","s {0}= {1} cm\n(corrisp. {2} pz.)\nF R,d = {3} kN","s {0}= {1} cm\n(corresp. à {2} pcs.)\nF R,d = {3} kN","s {0}= {1} cm%A (vastab {2} tk)¯ R,d = {3} kN",null,null,null,null,null,null,"\"S {0} = {1}, cm odpovídá {2}ks,F R,d = {3} kN"]
["tc_slsEinznix","Einzellasten werden für den Schwingungsnachweis nicht berücksichtigt","Concentrated loads are not considered in this vibration design","I singoli carichi non sono considerati per la dimostrazione delle oscillazioni","Les charges individuelles ne sont pas prises en compte pour la preuve de vibration","Vibratsioonianalüüsis ei võeta arvesse individuaalseid koormusi.",null,null,null,null,null,null,"Koncentrované zatížení pro ověření vibrace není zohledněno"]
["tc_slsi","Vorverformungen aus Bauzuständen werden in den Nachweisen der Gebrauchstauglichkeit nicht berücksichtigt.","Initial construction stages displacements are not considered in serviceability limit state design.","Le deformazioni preesistenti riconducibili allo stato della costruzione non vengono considerate nelle verifiche dell’idoneità all’uso.","Les pré-déformations dues aux conditions de construction ne sont pas prises en compte dans la conception de l'état limite de fonctionnement.","Kasutatavuse kontrollimisel ei võeta arvesse ehitusetappide eeldeformatsioone."]
["tc_sminunt","! Mindestabstand a1 unterschritten. Konstruktive Maßnahmen erforderlich","! Minimal spacing a1 underrun. Constructive measurements required.","! distanza minima a1 non rispettata. sono necessari interventi costruttivi.","! Distance minimale a1 non atteinte. Mesures de conception requises","! Minimaalset vahemaad a1 ei ole saavutatud. Vajalikud konstruktiivsed meetmed"]
["tc_snow","Schnee","snow","Neve","Neige","Lumi",null,null,null,null,null,null,"Sníh"]
["tc_span","Spannweite","Span","Luce","Envergure","Spaan",null,null,null,null,null,null,"Rozpětí"]
["tc_spannu","Spannungen","Stresses","Tensioni","Contraintes","Pinged",null,null,null,null,null,null,"Napětí"]
["tc_spannw","Spannweite ℓ:","Span ℓ:","Luce ℓ:","Envergure ℓ :","Vahemik ℓ:",null,null,null,null,null,null,"Rozpětí ℓ:"]
["tc_spannw1_","Spannweite des Deckenfeldes","Floor span","Luce campata soletta","Envergure du plafond","Laepaneelide vahekaugus",null,null,null,null,null,null,"Rozpětí  panelu"]
["tc_spannw2_","Spannweite ℓ: Abstand gemessen von Mitte Auflager zu Mitte Auflager","Span ℓ: Distance between the centre of support A and the centre of support B","Luce ℓ: distanza misurata da centro appoggio a centro appoggio","Envergure ℓ : distance mesurée du centre de l'appui au centre de l'appui","Vahekaugus ℓ: kaugus, mõõdetuna tugikeskmest kuni tugikeskmeni.",null,null,null,null,null,null,"Rozpětí ℓ: vzdálenost měřená od středu ke středu podpory (nosníku)"]
["tc_sparre","Sparren","rafter","Travetto inclinato","Chevron","Rafterid",null,null,null,null,null,null,"Krokev"]
["tc_ständi","Ständige Auflast g2,k:","Additional dead load g2,k:","Carico strutturale costante g2, k:","Charge constante g2,k :","Püsiv pealekantav koormus g2,k:",null,null,null,null,null,null,"g2- trvalá zátěž, k:"]
["tc_ständi1","Ständige Auflast","Additional dead load","Carico struttuale costante","Charge constante","Alaline koormus",null,null,null,null,null,null,"Trvalá zátěž"]
["tc_ständi2_","Ständige Lasten Gesamt","Total permanent loads","Carico costante complessivo","Charge constante totale","Alalised koormused Kokku",null,null,null,null,null,null,"Stálé celkové zatížení "]
["tc_ständi3_","Ständige Auflasten","Permanent surcharges","Carichi strutturali costanti","Charges constantes","Püsikoormused",null,null,null,null,null,null,"Permanentní zatížení"]
["tc_ständian","Ständiger Anteil Gk:","Dead load Gk:","Percentuale costante Gk:","Proportion constante Gk :","Alaline osa Gk:",null,null,null,null,null,null,"Stálé podíl Gk:"]
["tc_stärke","Stärke der Trennlage","Thickness of intermediate layer","Spessore divisoria","Épaisseur de la couche de séparation","Eralduskihi paksus",null,null,null,null,null,null,"Síla separační vrstvy"]
["tc_statis","statische Einzellast","Static concentrated load","Carico singolo statico","Charge individuelle statique","Staatiline ühekordne koormus",null,null,null,null,null,null,"Statické zatížení"]
["tc_stelleinz","Stelle der Einzellast x :","Location of concentrated load x:","Posizione carico singolo x:","Emplacement de la charge individuelle x :","Kontsentreeritud koormuse asukoht x :",null,null,null,null,null,null,"Místo statického zatížení x:"]
["tc_stk.","Stk.","pcs.","Pz.","Pcs.","tk.",null,null,null,null,null,null,"Kus"]
["tc_stützw","Stützweite der Platte","Slab span","Distanza tra gli appoggi della soletta","Portée de la dalle","Plaadi laius",null,null,null,null,null,null,"Rozpětí desky"]
["tc_system","SYSTEM:","SYSTEM:","SISTEMA:","SYSTÈME :","SÜSTEEM:",null,null,null,null,null,null,"SYSTEM:"]
["tc_t = 0","t = 0","t = 0","t = 0","t = 0","t = 0",null,null,null,null,null,null,"t = 0"]
["tc_t = 8","t = ∞","t = ∞","t = ∞","t = ∞","t = ∞",null,null,null,null,null,null,"t = ∞"]
["tc_t h,d","τ H,d","τ H,d","τ H,d","τ H,d","τ H,d",null,null,null,null,null,null,"τ H, d"]
["tc_t-con ","{0} Schrauben ","{0} screws","Viti {0}","Vis {0} ","{Kruvid",null,null,null,null,null,null,"{0} šrouby"]
["tc_text","Text","text","Testo","Texte","Tekst",null,null,null,null,null,null,"Text"]
["tc_träger","Träger","Beam","Trave","Support","Kandevahend",null,null,null,null,null,null,"Trám"]
["tc_tragfä","Tragfähigkeit (GZT)","Ultimate limit state (ULS)","Portata (stato limite)","Force portante (ELU)","Kandevõime (GZT)",null,null,null,null,null,null,"Nosnost - mezní stav"]
["tc_tragfä2_","Tragfähigkeit","Ultimate limit state","Portata","Force portante","Kandevõime",null,null,null,null,null,null,"Nosnost"]
["tc_tragfä3_","Tragfähigkeit im Brandfall (nach EN 1995-1-2 / B 1995-1-2)","Ultimate limit state in case of fire (EN 1995-1-2 / B 1995-1-2)","Portata in caso di incendio (ai sensi della EN 1995-1-2 / B 1995-1-2)","Force portante en cas d'incendie (conformément à EN 1995-1-2 / B 19951-2)","Kandevõime tulekahju korral (vastavalt EN 1995-1-2 / B 1995-1-2)",null,null,null,null,null,null,"Nosnost v případě požáru (EN 1995-1-2 / B 01.2.1995)"]
["tc_tramab","Tramabstand be:","Axial beam distance 'be':","Distanza 'be' della trave principale 'be' :","Distance de la trame 'be' :","Trammi kaugus olla:",null,null,null,null,null,null,"Odstup trámů 'be':"]
["tc_träme","Träme","Timberbeams","Travi principali","Trames","Pisarad",null,null,null,null,null,null,"Trámy"]
["tc_tramla","Tramlage","Timber beams","Posizione della trave principale","Position de la trame","Trammi asukoht",null,null,null,null,null,null,"Poloha trámu"]
["tc_traufl","Trauflänge","Eaves length","Lunghezza Chénau","Longueur Chénau ","Räästade pikkus"]
["tc_trennw","Trennwandzuschlag:","Partition wall surcharge:","Supplemento parete divisoria","Couche de séparation :","Jaotuse lisamaks:",null,null,null,null,null,null,"Přepážka - přídavek"]
["tc_trennw1_","Trennwandzuschlag","Partition wall surcharge","Supplemento parete divisoria","Couche de séparation","Jaotustasu lisatasu",null,null,null,null,null,null,"Přepážka - přídavek"]
["tc_v 1,d","V 1,d","V 1,d","V 1,d","V 1,d","V 1,d",null,null,null,null,null,null,"V 1, d"]
["tc_v 2,d","V 2,d","V 2,d","V 2,d","V 2,d","V 2,d",null,null,null,null,null,null,"V 2, d"]
["tc_v d","V d","V d","V d","V d","V d",null,null,null,null,null,null,"V d"]
["tc_v ed","v Ed","v Ed","v Ed","v Ed","v Ed",null,null,null,null,null,null,"v Ed"]
["tc_verbin","VERBINDUNGSMITTEL:","SCREWS:","ELEMENTO DI GIUNZIONE","DISPOSITIFS D'ASSEMBLAGE :","KINNITID:",null,null,null,null,null,null,"Spojovací prostředky:"]
["tc_verein","Vereinfacht wird für die Betonplatte alleine ein Brandwiderstand von ","As simplification the fire resistance of the concrete slab is considered to be ","Per la soletta in cemento viene semplificata una resistenza alle fiamme di ","Pour la dalle en béton seule, la résistance au feu est réduite de ","Lihtsustatult öeldes on tulepüsivus",null,null,null,null,null,null,"Zjednodušeno pro betonovou desku -  požární odolnost"]
["tc_versch","Verschiebesteifigkeit einer Schraube","Displacement stiffness of one screw","Resistenza allo spostamento di una vite","Rigidité au déplacement d'une vis","Kruvi nihke jäikus",null,null,null,null,null,null,"Posunutí tuhosti šroubu"]
["tc_verst","Verschiebesteifigkeit (für {0} Verbindungsmittel nebeneinander)","Displacement stiffness (for {0} screws in a row)","Resistenza allo spostamento ( per 0 elementi di giunzione l'uno accanto all'altro)","Rigidité au déplacement (pour {0} dispositif(s) d'assemblage l'un à côté de l'autre)","nihkejäikus ({0} kinnitusdetailide puhul üksteise kõrval)",null,null,null,null,null,null,"Posunutí tuhosti (pro {0} spojovací prostředky vedle sebe)"]
["tc_von ei","von EI starr","of EI rigid","di El  rigido","par EI starr","EI jäigast",null,null,null,null,null,null,"od EI - tuhost"]
["tc_vorbem","Bemessung von {0} Verbundschrauben\n","Preliminary design of {0} Composite-Screws\n","Dimensionamento preventivo di viti di raccordo {0}","Mesure préliminaire des vis composites {0}\n","{0} liitkruvide mõõtmete määramine%A",null,null,null,null,null,null,"Předběžný návrh kompozitních šroubů {0}"]
["tc_vorbem1","auf Grundlage von EN 1995-1-1 mit B 1995-1-1","based on EN 1995-1-1 with B 1995-1-1","sulla base della norma EN 1995-1-1 con B 1995-1-1","sur la base EN 1995-1-1 avec B 1995-1-1","põhineb EN 1995-1-1 ja B 1995-1-1 standardil.",null,null,null,null,null,null,"Založené na  Obecném EN 1995-1-1 s B 1995-1-1"]
["tc_vorbem3","Bemessung von {0} Verbundschrauben, Nachweise der Tragfähigkeit im Brandfall","Preliminary design of {0} Composite-Screws, Fire design","Dimensionamento preventivo di viti di raccordo {0}, comprova della portata in caso di incendio","Mesure préliminaire des vis composites {0}, preuves de la force portante en cas d'incendie","{0} komposiitkruvide projekteerimine, kandevõime kontrollimine tulekahju korral",null,null,null,null,null,null,"Předběžný návrh {0} kompozitních šroubů, důkaz odolnosti v případě požáru"]
["tc_vorbem4","auf Grundlage von EN 1995-1-2","based on the technical approvals {0} \nand EN 1995-1-2","sulla base dell'Omologazione generale dell'Ispettorato lavori edili {0} e della norma EN 1995-1-2","sur la base de l'agrément technique général {0} et EN 1995-1-2","EN 1995-1-2 alusel",null,null,null,null,null,null,"Na základě Obecném stavebním schválení {0} a EN 01.02.1995"]
["tc_vorbem6","Bemessung von {0} Verbundschrauben, Schwingungsnachweis","Preliminary design of {0} Composite-Screws, vibration design","Dimensionamento preventivo di viti di raccordo {0}, comprova  oscillazioni","Mesure préliminaire des vis composites {0}, preuve de vibration","{0} komposiitpoltide projekteerimine, vibratsioonianalüüs",null,null,null,null,null,null,"Předběžný návrh {0} kompozitních šroubů, odolné proti vibracím"]
["tc_vorh. ","vorh. Randabstand d. Verbindungsmittels rechtwinkelig zur Faserrichtung","Existing edge distance of screws perpendicular to grain direction","distanza dal bordo presente degli elementi di giunzione perpendicolarmente alla direzione delle fibre","Distance des bords exis. du dispositif d'assemblage perpendiculairement à la direction des fibres","kinnitusdetaili olemasolev serva kaugus risti kiu suunda arvestades",null,null,null,null,null,null,"Vzdálenost od okraje  spojovacích prostředků kolmo k vláknům"]
["tc_vorh4","vorh","calc","presente","exis","saadaval",null,null,null,null,null,null,"exist."]
["tc_w cree","w creep,Holz","w creep,timber","w creep, legno","w creep,bois","w roomamine,puit",null,null,null,null,null,null,"w dotvarování, dřevo"]
["tc_w net,","w net,fin","w net,fin","w net,fin","w net,fin","w net,fin",null,null,null,null,null,null,"w net, fin"]
["tc_w qst.","w qst.","w qp","w qst.","w qst.","w qst.",null,null,null,null,null,null,"w QST."]
["tc_w schw","w Schwinden","w shrinkage","w ritiri","w retrait","w Kahanemine",null,null,null,null,null,null,"w smrštění"]
["tc_w stat","w stat","w stat","w stat","w stat","w stat",null,null,null,null,null,null,"w stat"]
["tc_w zul","w zul","w allow","w ammesso","w zul","w lubatud",null,null,null,null,null,null,"w perm"]
["tc_wider2","Widerstand (F R,d)","Resistance (F R,d)","Resistenza (F R, d)","Résistance (F R,d)","Vastupidavus (F R,d)",null,null,null,null,null,null,"Odolnost (R F, d)"]
["tc_widers","Widerstandsmomente","Section moduli","Coppie resistenza","Modules d'inertie","Vastupidavuse pöördemomendid",null,null,null,null,null,null,"Moduly odolnosti"]
["tc_winkel","Winkel d. Verschraubung ","Screw angle","Angolo di avvitamento","Angle du raccord vissé ","Kruviühenduse nurk",null,null,null,null,null,null,"Úhel  dla šroubování"]
["tc_winkelEF","Eff. Winkel für Steifigkeit","Angle for stiffness","angelo per rigidezza","anlge pour rigidités","Eff. Jäikuse nurk",null,null,null,null,null,null,"Úhel pro plochy"]
["tc_x s","x s","x s","x s","x s","x s",null,null,null,null,null,null,"x s"]
["tc_zusamm","Zusammenfassung der Bemessung von {0} Verbundschrauben","Preliminary design summary of {0} Composite Screws","Sintesi della misurazione preventiva delle viti di raccordo {0}","Résumé de la mesure préliminaire des vis composites {0}","Kokkuvõte {0} liitkruvide dimensioneerimisest",null,null,null,null,null,null,"Shrnutí předběžného návrhu kompozitních šroubů {0}"]
["tc_zusamm2_","Zusammenfassung","Result summary","Sintesi","Résumé","Kokkuvõte",null,null,null,null,null,null,"Shrnutí"]
["tc_zusatz","Zusatzblatt für den Nachweis der Schalung beim Betonieren","Additional sheet of proof for formwork design","Scheda aggiuntiva per la comprova delle casseforme durante la gettata","Fiche supplémentaire pour la preuve du coffrage par bétonnage","Täiendav leht betoneerimise ajal toimuva betoonimise kontrollimiseks",null,null,null,null,null,null,"Další list pro detekci bednění při betonáži"]
["tc_zusatzbe","Lt. Zulassung ist eine Zusatzbewehrung vorzusehen! Nähere Details dazu findet man in den Zulassungsunterlagen.","according to the technical approval, additional reinforcement is required! Please see the documents for details.","Secondo l'omologazione occorre prevedere un'armatura aggiuntiva! Per ulteriori dettagli si veda la documentazione dell'omologazione.","D'après l'agrément, une armature supplémentaire doit être prévue ! De plus amples détails sont disponibles dans les documents joints à l'agrément.","Vastavalt tüübikinnitusele tuleb ette näha täiendav tugevdus! Täiendavad üksikasjad on esitatud tüübikinnitusdokumentides.",null,null,null,null,null,null," Dodatečné vyztužení! Další podrobnosti lze nalézt v registračních dokladech."]
["tc_zusatzh","Zusatzblatt für abgerundete Holzquerschnitte","Additional worksheet for rounded cross-sections","Scheda aggiuntiva per sezioni di legno arrotondate","Fiche supplémentaire pour des coupes transversales du bois","Täiendav leht ümardatud puidu ristlõike jaoks",null,null,null,null,null,null,"Další list pro oblé příčné řezy dřeva"]
["tc_zwisch","Zwischenlage (Schalung)","Intermediate layer (formwork)","Strato intermedio (casseforme)","Couche intermédiaire (coffrage)","Vahekiht (šabloon)",null,null,null,null,null,null,"Mezivrstva - bednění"]
["tcd_äquval","Äquivalente Querschnittsbreiten für Rechteck mit Höhe h","Equivalent cross-section widths for a rectangle b in width","larghezze di sezione equivalenti per un rettangolo di altezza h","Largeurs de section équivalentes pour un rectangle de hauteur h","Ekvivalentne ristlõike laius ristküliku puhul, mille kõrgus on h"]
["tcd_ausrun","Ausrundungsradius","rounding off radius","Raggio di curvatura","Rayon de courbure","Filee raadius"]
["tcd_bogenl","Bogenlänge","arc length","Lunghezza dell'arco","Longueur de l'arc","Kaare pikkus"]
["tcd_dippel","Dippelbaumdecke: Rechteckquerschnitt mit Ausrundung an der Oberseite","dowel beams: Rectangular cross-section with rounded top","Trave Dippel deck: sezione rettangolare con raccordo in alto","Pont de poutres en diagonale : section rectangulaire avec un filet en haut","Dipple-tala lagi: ristkülikukujuline ristlõige, ümarate ülemiste osadega"]
["tcd_entspr","entsprechende Fläche für  τ = V d / A τ","euqivalent area for τ = V d / A τ","superficie corrispondente per τ = V d/A τ","Surface correspondante pour τ = V d/A τ","vastav pindala Ï = V d / A Ï"]
["tcd_für g2","für gleiches Trägheitsmoment I","for equal moment of inertia I","per un momento d'inerzia uguale I","pour un moment d'inertie égal I","sama inertsimomendi I puhul"]
["tcd_für gl","für gleiche Fläche A","for equal area A","per un'area uguale A","pour la même zone A","sama ala A puhul"]
["tcd_fürg3","für gleiches Widerstandsmoment unten","for equal section modulus bottom","per momento resistente inferiore uguale","Pour le même moment de résistance à la base","sama läbilõikemooduli korral põhjas"]
["tcd_fürg4","für gleiches Widerstandsmoment oben","for equal section modulus top","per momento resistente superiore uguale","Pour le même moment de résistance en haut","sama ristlõikemooduli puhul ülaosas"]
["tcd_fürg5","für gleiche Schubspannung","for equal shear stress","per un uguale sforzo di taglio","pour une contrainte de cisaillement égale","võrdse nihkepinge korral"]
["tcd_gesamt","Gesamt","total","totale","total","Kokku"]
["tcd_halber","halber Öffnungswinkel","half of opening angle","mezzo angolo di apertura","demi-angle d'ouverture","Pool avanemisnurk"]
["tcd_höher","Höhe Rechteckiger Bereich","height of rectangular part","altezza segmento rettangolare","hauteur segment rectangulaire","Kõrgus Ristkülikukujuline pindala"]
["tcd_kreiss","Kreissegment","circle segment","Segmento di cerchio","Segment de cercle","Ringikujuline segment"]
["tcd_mittel","Mittelpunktslage","circle centre position","posizione del punto mediano","Position centrale","Keskuse positsioon"]
["tcd_öffnun","Öffnungswinkel","opening angle","Angolo di apertura","Angle d'ouverture","Avamisnurk"]
["tcd_quersc","Querschnittswerte der Teile ","section values of parts","valori delle sezioni degli elementi ","Valeurs de la section des éléments","Osade ristlõike väärtused"]
["tcd_rechte","Rechteck","rectangle","Rettangolo","Rectangle","Ristkülikukujuline"]
["tcd_schubs","Schubspannung für V = 1 kN","shear stress for V = 1 kN","sollecitazione di taglio per V = 1 kN","Contrainte de cisaillement pour V = 1 kN","Nihkepinge V = 1 kN korral"]
["tcd_schwe2","Schwerpunkt im {0} ","CG in {0}","Centro di gravità a {0}","Centre de gravité à {0}","Raskuskese {0}"]
["tcd_schwer","Schwerpunktslagen","CG position","Posizioni del centro di gravità","Positions du centre de gravité","Gravitatsioonikeskus"]
["tcd_segmen","Segmenthöhe","segment height","Altezza del segmento","Hauteur du segment","Segmendi kõrgus"]
["tcd_statis","Statisches Moment","static moment","Momento statico","Moment statique","Staatiline moment"]
["tcd_träghe","Trägheitsmoment","moment of inertia","Momento d'inerzia","Moment d'inertie","Inertsmoment"]
["tcf_cancel","Abbrechen","Cancel","Rottura","Rupture","Tühista",null,null,null,null,null,null,"Přerušit"]
["tcf_durchm","Durchmesser","Diameter","Diametro","Diamètre","Läbimõõt",null,null,null,null,null,null,"Průměr"]
["tcf_gesl","Gesamtlänge","Total length","Lunghezza totale","Longueur totale","Kogupikkus",null,null,null,null,null,null,"Celková délka"]
["tcf_gewl","Gewindelänge","Thread length","Lunghezza filettatura","Longueur de filetage","Niidi pikkus",null,null,null,null,null,null,"Délka závitu"]
["tcf_langco","Sprache und Norm","Language and Code","Lingua e norma","Langue et norme","Keel ja standard",null,null,null,null,null,null,"Jazyk a norma"]
["tcf_langid","Sprache","Language","Lingua","Langue","Keel",null,null,null,null,null,null,"Jazyk"]
["tcf_lic1","Lizenzbedingungen","Licence and diclaimer","Condizioni di licenza","Conditions d'octroi de licence","Litsentsitingimused",null,null,null,null,null,null,"Licenční podmínky"]
["tcf_lic2","Ich akzeptiere die Lizenzbedingungen","I accept the terms","Dichiaro di accettare le condizioni di licenza","J'accepte les conditions d'octroi de licence","Nõustun litsentsitingimustega",null,null,null,null,null,null,"Přijímám licenční podmínky"]
["tcf_nad","Nationaler Anhang","national annex","Allegato nazionale","Annexe nationale","Riiklik lisa",null,null,null,null,null,null,"Národní příloha"]
["tcf_OK","OK","OK","OK","OK","OK",null,null,null,null,null,null,"OK"]
["tcf_pr1","Drucken...","Print…","Stampa ...","Imprimer...","Prindi...",null,null,null,null,null,null,"Tisk ..."]
["tcf_pr2","Wählen Sie die zu druckenden Dateien aus","Choose files to be printed","Selezionare i file da stampare","Sélectionnez les fichiers à imprimer","Valige printimiseks vajalikud failid",null,null,null,null,null,null,"Vyberte soubory, které mají být vytištěny"]
["tcf_type","Typ","type","Tipo","Type","Tüüp",null,null,null,null,null,null,"Typ"]
["tcf_vtyp","Vorzugstyp","prefered types","Tipo di priorità","Type privilégié","Eelistuse tüüp",null,null,null,null,null,null,"Výhodný typ"]
["tcplh_03","&\"-,Fett\"&14Bemessung von {1} Verbundschrauben&\"-,Standard\"&11\n&10gem.: {0} \n &11\n","&\"-,Fett\"&14Preliminary design of {1} Screws&\"-,Standard\"&11\n&10as per.: {0} \n &11\n","&\"-,Fett\"&14Dimensionamento preventivo di viti di raccordo {1} &\"-,Standard\"&11\n&10 ai {0}\n &11\n","&\"-,Fett\"&14Mesure préliminaire des vis composites {1}&\"-,Standard\"&11\n&10gem. : {0}\n &11\n","&\"-,määre\"&14Komposiitkruvide {1} dimensioneerimine&\"-,standard\"&11%A&10gem.: {0} %A &11%A",null,null,null,null,null,null,"&\"-,Fett\"&14předběžný návrh kompozitních šroubů {1} &\"-,Standard\"&11\n&10 dle  {0}   &11"]
["tcplh_04","Zusammenfassung der statischen Berechnung - Kurzausgabe","Summary of the structural analysis - Results in brief","Sinstesi del calcolo statico - Versione breve","Résumé du calcul statique - édition abrégée","Staatilise arvutuse kokkuvõte - lühendatud versioon",null,null,null,null,null,null,"Shrnutí statických výpočtů - krátká verze"]
["tcplh_05","&\"-,Fett\"&12Nachweisführung","&\"-,Fett\"&12Verification","&\"-,Fett\"&12Produzione comprova","&\"-,Fett\"&12Justification","&\"-,määre\"&12Kindla halduse tagamine",null,null,null,null,null,null,"&\"-,Fett\"&12 ověření"]
["tcplh_07","&\"-,Fett\"&12Tragfähigkeit im Brandfall","&\"-,Fett\"&12ULS in fire","&\"-,Fett\"&12Portata in caso di incendio","&\"-,Fett\"&12Force portante en cas d'incendie","&\"-,määrde\"&12Kandevõime tulekahju korral",null,null,null,null,null,null,"&\"-,Fett\"&12 únosnost v případě požáru"]
["tcplh_08","&\"-,Fett\"&12Schwingungsnachweis","&\"-,Fett\"&12Vibration design","&\"-,Fett\"&12Comprova oscillazioni","&\"-,Fett\"&12Preuve de vibration","&\"-,rasva\"&12Vibratsioonikindel",null,null,null,null,null,null,"&\"-,Fett\"&12 detekce chvění"]
["tcplh_09","&\"-,Fett\"&12Bemessung der Schalung","&\"-,Fett\"&12Preliminary design of formwork","&\"-,Fett\"&12dimensionamento preventivo casseforme","&\"-,Fett\"&12Mesure préliminaire du coffrage","&\"-,määrimine\"&12Suluse mõõtmete määramine",null,null,null,null,null,null,"&\"-,Fett\"&12Předběžný návrh bednění"]
["tcplh_12","&\"-,Fett\"&12Bauzustand","&\"-,Fett\"&12construction stage","&\"-,Fett\"&12fase di costruzione","&\"-,Fett\"&12phase de construction","&\"-,Fett\"&12Bauzustand",null,null,null,null,null,null,"&\"-,Fett\"&12stavba jeviště"]
["tcplh_20","&\"-,Fett\"&12Dippelbaum-Querschnitt","&\"-,Fett\"&12dowel beams","&\"-,Fett\"&12travi a tassello","&\"-,Fett\"&12poutres à goujons","&\"-,määre\"&12Kaksikpuu ristlõige",null,null,null,null,null,null,"&\"-,Fett\"&12dowel beams"]
["tcvem_03_e","gem. Allgemeiner Bauaufsichtlicher Zulassung: Höhe der Zwischenlage darf 5cm nicht überschreiten.","acc. to technical approval: Thickness of intermediate layer may not exceed 5 cm.","secondo l'Omologazione generale dell'Ispettorato lavori edili: l'altezza dello strato intermedio non deve superare i 5 cm.","Conf. à l'agrément technique général: la hauteur de la couche intermédiaire ne doit pas dépasser 5 cm.","vastavalt üldisele ehitusinspektsiooni kinnitusele: vahekihi kõrgus ei tohi ületada 5 cm.",null,null,null,null,null,null,"dle   Obecného stavebního schválení : Výška vložky (mezivrstvy) nesmí přesáhnout 5 cm."]
["tcvem_03_val_0307","Die Betonplatte muss lt. Zulassung mind. 7cm und darf höchstens 30 cm dick sein bzw. darf höchstens eine Dicke von 70% des Holzbauteils haben.","The concrete slab thickness has to be between 7 cm and 30 cm and has to be less than 70% of the timber height.","Secondo l'omologazione la soletta in cemento deve avere uno spessore di almeno 7 cm e massimo 30 cm oppure deve avere uno spessore del 70% del componente in legno.","L'épaisseur de la dalle en béton doit être au min. égale à 7 cm et au maximum à 30 cm ou doit être égale au maximum à 70 % de l'élément en bois.","Tüübikinnituse kohaselt peab betoonplaat olema vähemalt 7 cm paksune ja mitte paksem kui 30 cm või mitte paksem kui 70% puitdetailist.",null,null,null,null,null,null,"Betonová deska musí mít tloušťku min. 7 cm a nejvýše  30 cm, př. nejvýše  70% dřevěné části."]
["tcvem_03_val_0316","Der Mindestabstand in Faserrichtung beträgt 10 cm","The minimum distance in grain direction is 10 cm","La distanza minima nella direzione della fibra è di 10 cm","La distance minimum en direction des fibres est de 10 cm","Minimaalne kaugus kiu suunas on 10 cm.",null,null,null,null,null,null,"Minimální vzdálenost ve směru vláken je 10 cm"]
["tcvem_03_val_0317","Für das Berechnungsverfahren laut Norm darf der Maximalabstand s max das vierfache des Minimalabstandes s min nicht überschreiten.\ns max < 4 · s min","According to Eurocode 5 the maxium screw distance s max may not exceed the minum distance s min by four.","Distanza massima: s max < 4 . s min","Distance maximum :\ns max < 4   s min","Standardi kohase arvutusmeetodi puhul ei tohi maksimaalne kaugus s max ületada neljakordset minimaalset kaugust s min.%As max < 4 - s min",null,null,null,null,null,null,"Podle normy nesmí překročit maximální vzdálenost s  čtyřnásobek minimální vzdálenosti s.  \" s max <4 · s min \""]
["tcvet_03_e","Zwischenlage zwischen 0 und 5 cm","intermediate layer between 0 and 5 cm","Strato intermedio tra 0 e 5 cm","Couche intermédiaire entre 0 et 5 cm","Vahepealne kiht vahemikus 0-5 cm",null,null,null,null,null,null,"Mezivrstva v rozmezí 0 až 5 cm"]
["tcvet_03_val_0307","Dicke Betonplatte nicht möglich","thickness of concrete slab not possible","Soletta in cemento spessa non possibile","Épaisseur de la dalle en béton impossible","Paks betoonplaat ei ole võimalik",null,null,null,null,null,null,"Silná betonová deska není možná"]
["tcvet_03_val_0316","Mindestabstand in Faserrichtung","Minimum distance in grain direction","distanza minima nella direzione della fibra","Distance minimum en direction des fibres","Minimaalne kaugus kiu suunas",null,null,null,null,null,null,"Minimální vzdálenost ve směru vláken"]
["tcvet_03_val_0317","unzulässiger Maximalabstand","allowed maximum distance is exceeded","distanza massima non ammessa","Distance maximum non autorisée","Lubamatu maksimaalne kaugus",null,null,null,null,null,null,"Nevhodná maximální vzdálenost"]
["tcvim_03_alpha","Wenn eine Trennlage/Zwischenschicht vorhanden ist, sollte der Winkel unbedingt mit 45° angenommen werden.","If an intermediate layer exists, the screws should be inclided by 45°.","Se è presente una divisoria / strato intermedio, dovrebbe essere considerato assolutamente un angolo di 45°.","Si une couche de séparation/couche intermédiaire est présente, un angle de 45° doit impérativement être adopté.","Eralduskihi/vahelise kihi olemasolul tuleb alati eeldada, et nurk on 45°.",null,null,null,null,null,null,"Je-li přítomna separační vrstva (mezivrstva),  měl by být úhel  45 °."]
["tcvim_03_val_0309","gem. Allgemeiner Bauaufsichtlicher Zulassung: Der Beton muss mind. der Festigkeitsklasse C20/25 entsprechen, die Nenngröße des Größtkorn des Betonzuschlags darf 16mm nicht überschreiten.","acc. to approval: Concrete has to be of grade C20/25 or higher. Accepted nominal size of the largest grains in the concrete aggregate may not exceed 16mm.","ai sensi dell'Omologazione generale dell'Ispettorato lavori edili: il cemento deve essere conforme almeno alla classe di resistenza C20/25, la dimensione nominale del grano più grosso dell'inerto non deve superare i 16 mm.","Conf. à l'agrément technique général :  le béton doit correspondre au min. à la classe de résistance C20/25, la taille nominale du grain le plus grossier de l'adjuvant au béton ne doit pas dépasser 16 mm.","vastavalt üldisele ehitusinspektsiooni kinnitusele: betoon peab vastama vähemalt tugevusklassile C20/25, betooni täitematerjali maksimaalne nimisuurus ei tohi ületada 16 mm.",null,null,null,null,null,null,"dle Obecného stavebního schválení: Beton musí odpovídat minimálně pevnostní třídě C20 / 25 , jmenovitá velikost i částic betonového agregátu nesmí překročit 16mm."]
["tcvim_03_val_0311","gem. Allgemeiner Bauaufsichtlicher Zulassung: Holzbauteile aus Vollholz mindestens Festigkeitsklasse C24.","acc. to approval: Timber members of solid wood have to be of grade C24 or higher.","ai sensi dell'Omologazione generale dell'Ispettorato lavori edili: i componenti in legno massiccio devono  conformarsi almeno alla classe di resistenza C24.","Conf. à l'agrément technique général: éléments en bois massif au moins de la classe de résistance C24.","vastavalt üldisele ehitusinspektsiooni kinnitusele: vähemalt tugevusklassi C24 täispuidust valmistatud puitdetailid.",null,null,null,null,null,null,"dle Obecného stavebního  schválení: dřevěné součásti vyrobené z masivního dřeva  třídy pevnost ialespoň C24."]
["tcvim_05_val_0502","gem. ÖNORM B 1995-1-1: Die Durchbiegung \"wg1\" des lastabtragenden Bauteils darf unberücksichtigt bleiben, wenn sich diese Verformungen nicht negativ auf Ausbauten auswirken.","acc. to ÖNORM B 1995-1-1: The deflection \"w g1\" of the load bearing member may be unconsidered, if the deflection does not negatively effect the final completion.","ai sensi della ÖNORM B 1995-1-1: l'inflessione \"wg1\" del componente portante non deve essere presa in considerazione, se queste deformazioni non influiscono negativamente sui componenti. ","Conf. à ÖNORM B 1995-1-1 : la flèche « wg1 » de l'élément porteur ne doit pas être prise en compte si ces déformations n'influencent pas négativement les constructions.","vastavalt ÖNORM B 1995-1-1: kandva osa läbipainde \"wg1\" võib jätta arvestamata, kui need deformatsioonid ei mõjuta negatiivselt pikendusi.",null,null,null,null,null,null,"dle ÖNORM B 1995-1-1: Vychýlení \"WG1\" nosné stavební části  nemusí být dodrženo v případě, že tyto deformace nebudou mít nepříznivý vliv na finální dokončení."]
["tcvim_07_nb","links und rechts","left and right","destra e sinistra","gauche et droite","vasakule ja paremale",null,null,null,null,null,null,"vlevo a vpravo"]
["tcvim_07_nh","oben und unten","top and bottom","sopra e sotto","haut et bas","Ülemine ja alumine osa",null,null,null,null,null,null,"nahoře a dole"]
["tcvim_07_t","R 30, R 60, R 90","R 30, R 60, R 90","R 30, R 60, R 90","R 30, R 60, R 90","R 30, R 60, R 90",null,null,null,null,null,null,"R 30, R 60, R 90"]
["tcvim_07_val_0704","Auswirkung auf Wahl der Festigkeitsklasse (C24, GL 24h)","Effect on choice of timber class (C24, GL 24h)","Effetto sulla scelta della classe di resistenza (C24, GL 24h)","Effet sur le choix de la classe de résistance (C24, GL 24h)","Mõju tugevusklassi valikule (C24, GL 24h)",null,null,null,null,null,null,"Dopad na volbu třídy pevnosti (C24, GL 24)"]
["tcvit_03_alpha","Hinweis","hint","Avvertenza","Remarque","Vihje",null,null,null,null,null,null,"Pokyn:"]
["tcvit_03_val_0309","Hinweis:","hint:","Avvertenza:","Remarque :","Märkus:",null,null,null,null,null,null,"Pokyn:"]
["tcvit_03_val_0311","Hinweis:","hint:","Avvertenza:","Remarque :","Märkus:",null,null,null,null,null,null,"Pokyn:"]
["tcvit_05_val_0502","Hinweis","hint:","Avvertenza","Remarque","Vihje",null,null,null,null,null,null,"Pokyn:"]
["tcvit_07_nb","Anzahl der Seitenflächen","Number of side areas","Numero delle superfici laterali","Nombre de surfaces latérales","Külgede arv",null,null,null,null,null,null,"Počet bočních ploch"]
["tcvit_07_nh","Anzahl der horizontalen Flächen","Number of horizontal areas","Numero delle superfici orizzontali","Nombre de surfaces horizontales","Horisontaalsete pindade arv",null,null,null,null,null,null,"Počet vodorovných ploch"]
["tcvit_07_t","Anforderung - Brandwiderstand","Requirement - Fire","Requisito - Resistenza alle fiamme","Exigence - résistance au feu","Nõue - tulekindlus",null,null,null,null,null,null,"Požadavky - požární odolnost"]
["tcvit_07_val_0704","Materialart","Type of material","Tipo di materiale","Type de matériau","Materjali tüüp",null,null,null,null,null,null,"Druh materiálu"]
["tcwsn_01","Start","Start","Avvio","Démarrage","Start",null,null,null,null,null,null,"Start"]
["tcwsn_02","Menü","Menu","Menu","Menu","Menüü",null,null,null,null,null,null,"Menu"]
["tcwsn_03","Eingabeblatt","Input","Scheda inserimento","Feuille de saisie","Sisendleht",null,null,null,null,null,null,"Vstupní list"]
["tcwsn_04","Kurzausgabe","Brief results","Versione breve","Édition abrégée","Lühendatud väljaanne",null,null,null,null,null,null,"Zkrácená verze"]
["tcwsn_05","Berechnungsblatt","Analysis sheet","Foglio di calcolo","Fiche de calcul","Arvutusleht",null,null,null,null,null,null,"List výpočtu "]
["tcwsn_06","Querkraftdeckung","Shear Resistance","Resistenza forza di taglio","Couverture force transversale","Lõikevõime kate",null,null,null,null,null,null,"Smyková síla pokrytí"]
["tcwsn_07","Brandbemessung","Fire design","Misurazione fiamme","Mesure en cas d'incendie","Tulekahju dimensioneerimine",null,null,null,null,null,null,"Požární návrh"]
["tcwsn_08","Schwingungsnachweis","Vibration design","Comprova oscillazioni","Preuve de vibration","Vibratsiooni kontrollimine",null,null,null,null,null,null,"Vibrační návrh"]
["tcwsn_09","Zusatzblatt Schalung","Formwork design","Scheda aggiuntiva casseforme","Fiche supplémentaire coffrage","Täiendav šabloonileht",null,null,null,null,null,null,"Dodatečný list -  bednění"]
["tcwsn_10","Vokabel","Vocabulary","Glossario","Vocabulaire","Sõnavara",{"$f":"DeepLTranslate(B858,\"ET\",\"DE\")","v":"#HTTP Error: 403"},null,null,null,null,null,"Slovo"]
["tcwsn_14","Beton_gerissen","cracked concrete ","Campi di testo","Champs de texte","Betoon_cracked",null,null,null,null,null,null,"Poničený beton"]
["tcwsn_15","Berechnungswerte","Calculation values","DropDown","Menu déroulant","Arvutusväärtused",null,null,null,null,null,null,"Vypočtené hodnoty"]
["tcwsn_19","Materialkennwerte","Material values","Valori materiale","Valeurs du matériau","Materjali omadused",null,null,null,null,null,null,"Specifikace materiálu"]
["test","Deutsches Wort","English word","IT Word","FR Word","EE Word","PL Word","SE Word","NO Word","FI Word","LV Word","LT Word","CZ Word"]
["test_englishFallback","Deutsches Wort","English word"]
["test_onlyGerman","Deutsches Wort"]
["ws_01","Start","Start",null,null,"Start"]
["ws_02","Menü","menu",null,null,"Menüü"]
["ws_03","Standort","Location",null,null,"Asukoht"]
["ws_04","Dämmsystem","Thermal insulation",null,null,"Katuse isolatsioon"]
["ws_05","Zusammenf. weich","summary soft",null,null,"Pehme kokkuvõte"]
["ws_06","Zusammenf. hart","summary hard",null,null,"Raske kokkuvõte"]
["ws_07","Rechnung weich","calculation soft",null,null,"Arve pehme"]
["ws_08","Rechnung hart","calculation hard",null,null,"Arve kõvasti"]

{"sheet":"Listen","index":9,"n_rows":167,"n_cols":42,"rows_kept":167,"cut":false,"hidden":true,"merged":[[117,2,117,4],[40,11,40,18],[3,17,3,20],[7,1,7,7],[40,8,40,10],[41,8,41,10],[41,15,41,17],[41,11,41,14]]}
["Listen für das Modul Aufdachdämmung"]
[]
[]
[null,"lst_DaemmTyp",null,null,null,null,null,null,null,null,null,null,null,null,null,null,null,"KONTERLATTE"]
[{"$f":"MATCH('Thermal insulation'!B69,lst_DaemmTyp)","v":1},{"$f":"ml(\"ad_dämm1\",\"Druckfeste Dämmung\")","v":"Hard Insulation"},null,null,null,null,null,null,null,null,null,null,null,null,null,null,null,"gk2 [KN/m2]","fm,k [N/mm2]",null,"E0,mean [N/mm2]"]
[null,{"$f":"ml(\"ad_dämm2\",\"Weiche Dämmung\")","v":"Soft Insulation"},null,null,null,null,null,null,null,null,null,null,null,null,null,null,null,{"$f":"(b_kl*h_kl/100^2)/b_e*3.5","v":8.7500000000000008E-3},{"$f":"INDEX(data_KL,index_KL,1)","v":24},null,{"$f":"INDEX(data_KL,index_KL,2)","v":11000}]
[]
[null,"DÄMMUNG"]
[null,"Produkt","γ [KN/m³]","σ10% [N/mm2]","d_Dä [mm]",null,"E-Modul [N/mm2]","Stauchung 10% [mm]",null,"gkfl [kN/m³]","gk2 [KN/m2]"]
[null,{"$f":"INDEX(CHOOSE(index_DaemmTyp,lst_DaemmHart,lst_DaemmWeich),CHOOSE(index_DaemmTyp,A15,A34),1)","v":"Soft wood fibre insulation"},{"$f":"INDEX(CHOOSE(index_DaemmTyp,data_DaemmHart,data_DaemmWeich),CHOOSE(index_DaemmTyp,$A$15,$A$34),1)","v":3},{"$f":"INDEX(CHOOSE(index_DaemmTyp,data_DaemmHart,data_DaemmWeich),CHOOSE(index_DaemmTyp,$A$15,$A$34),2)","v":0.2},{"$f":"INDEX(CHOOSE(index_DaemmTyp,data_DaemmHart,data_DaemmWeich),CHOOSE(index_DaemmTyp,$A$15,$A$34),3)","v":60},null,{"$f":"INDEX(CHOOSE(index_DaemmTyp,data_DaemmHart,data_DaemmWeich),CHOOSE(index_DaemmTyp,$A$15,$A$34),5)","v":2.8},{"$f":"INDEX(CHOOSE(index_DaemmTyp,data_DaemmHart,data_DaemmWeich),CHOOSE(index_DaemmTyp,$A$15,$A$34),5)","v":2.8}]
[]
[]
[null,null,"data_DaemmHart"]
[null,"lst_DaemmHart","gk2 [KN/m2]","σ10% [N/mm2]","d_Dä [mm]",null,"E-Modul [N/mm2]","Stauchung 10% [mm]"]
[{"$f":"MATCH('Thermal insulation'!$B$70,lst_DaemmHart,0)","v":1},{"$f":"ml(\"lst_holzwung\", \"Holzweichfaserdämmung\")","v":"Soft wood fibre insulation"},3,0.2,60,null,2.8,{"$f":"E15*0.1","v":6},null,3,0.18]
[null,{"$f":"ml(\"lst_baudelus\", \"Bauder PIR Plus\")","v":"Bauder PIR Plus"},0.3,0.12,100,null,1.2,{"$f":"E16*0.1","v":10},null,0.3,0.03]
[null,{"$f":"ml(\"lst_baude sf\", \"Bauder PIR SF\")","v":"Bauder PIR SF"},0.3,0.12,100,null,1.2,{"$f":"E17*0.1","v":10},null,0.3,0.03]
[null,{"$f":"ml(\"lst_steicsal\", \"Steico universal\")","v":"Steico universal"},4.5000000000000009,0.2,60,null,{"$f":"D18*10","v":2},{"$f":"E18*0.1","v":6},null,4.5000000000000009,0.27]
[null,{"$f":"ml(\"lst_steicdry\", \"Steico universal dry\")","v":"Steico universal dry"},2.1,0.18,35,null,1,3.5,null,2.1,7.4999999999999997E-2]
[null,{"$f":"ml(\"lst_steicdry14\", \"Steico universal dry\")","v":"Steico universal dry"},1.7999999999999998,0.18,100,null,1,10,null,1.7999999999999998,0.18]
[null,{"$f":"ml(\"lst_steicdry15\", \"Steico spezial dry\")","v":"Steico special dry"},1.1666666666666667,0.1,120,null,2,12,null,1.1666666666666667,0.14000000000000001]
[null,{"$f":"ml(\"lst_steicerm\", \"Steico therm\")","v":"Steico therm"},1.3333333333333335,0.05,120,null,{"$f":"D22*10","v":0.5},12,null,1.3333333333333335,0.16]
[null,{"$f":"ml(\"lst_pavatlus\", \"Pavatherm plus\")","v":"Pavatherm plus"},1.7999999999999998,0.1,100,null,1,10,null,1.7999999999999998,0.18]
[null,{"$f":"ml(\"lst_pavatair\", \"Pavatherm isolair\")","v":"Pavatherm isolair"},3.5999999999999996,0.25,50,null,2.5,5,null,3.5999999999999996,0.18]
[null,{"$f":"ml(\"lst_purenlus\", \"puren PLUS\")","v":"puren PLUS"},0.3,0.12,100,null,1.2,10,null,0.3,0.03]
[null,{"$f":"ml(\"lst_klöbeerm\", \"Klöber PermoTherm\")","v":"Klöber PermoTherm"},0.39999999999999997,0.12,100,null,1.2,10,null,0.39999999999999997,0.04]
[null,{"$f":"ml(\"lst_braasort\", \"Braas Clima Comfort\")","v":"Braas Clima Comfort"},0.39999999999999997,0.12,100,null,1.2,{"$f":"E27*0.1","v":10},null,0.39999999999999997,0.04]
[null,{"$f":"ml(\"lst_rockwert\", \"Rockwool Masterrock NB Kaschiert\")","v":"Rockwool Masterrock NB laminated"},2,0.05,100,null,0.5,{"$f":"E28*0.1","v":10},null,2,0.2]
[null,{"$f":"ml(\"lst_gutexerm\", \"Gutex Ultratherm\")","v":"Gutex Ultratherm"},2.25,0.05,80,null,0.5,{"$f":"E29*0.1","v":8},null,2.25,0.18]
[null,{"$f":"ml(\"lst_freieabe\", \"freie Eingabe\")","v":"free input"}]
[]
[null,null,"data_DaemmWeich"]
[null,"lst_DaemmWeich","gk2 [KN/m2]","σ10% [N/mm2]","d_Dä [mm]",null,"E-Modul [N/mm2]","Stauchung 10% [mm]"]
[{"$f":"MATCH('Thermal insulation'!$B$70,lst_DaemmWeich,0)","v":{"$error":"#N/A"}},{"$f":"ml(\"lst_sft_weichung\", \"Weiche Dämmung\")","v":"Soft insulation"},0.13,0.05,120,null,0.5,{"$f":"E34*0.1","v":12}]
[null,{"$f":"ml(\"lst_sft_steicerm\", \"Steico therm\")","v":"Steico therm"},0.16,0.05,120,null,0.5,{"$f":"E35*0.1","v":12}]
[null,{"$f":"ml(\"lst_sft_gutexafe\", \"Gutex Theromsafe\")","v":"Gutex Theromsafe"},0.11,0.05,120,null,0.5,{"$f":"E36*0.1","v":12}]
[null,{"$f":"ml(\"lst_sft_freieabe\", \"freie Eingabe\")","v":"free input"}]
[]
[null,"SCHRAUBEN"]
[null,8,20,23,19,22,13,12]
[null,null,null,null,null,null,null,null,"Druckfeste Dämmung",null,null,"weiche Dämmung"]
[null,null,null,null,null,null,null,null,"schräge Schrauben ",null,null,"Schraube_2 (Zug)",null,null,null,"Schraube_1 (Druck)"]
[null,"Produkt","d [mm]","dk [mm] ","L_Gesamt [mm]","L_Gewinde","Kopfdurchzieh","Ausziehp.","l ef,L [mm]","l ef,UK [mm]","L D[mm]","l ef,L [mm]","l ef,UK [mm]","L D [mm]","R ki,d [KN]","l ef,L [mm]","l ef,UK [mm]","L D [mm]","R ki,d [KN]"]
[null,{"$f":"INDEX(dat_schrauben,index_schraube,B40)","v":"ESSVE CY-FT  8,0 x 450/427"},{"$f":"INDEX(dat_schrauben,index_schraube,C40)","v":8},{"$f":"IF(ISNUMBER(INDEX(dat_schrauben,index_schraube,D40)),INDEX(dat_schrauben,index_schraube,D40),0)","v":10.199999999999999},{"$f":"INDEX(dat_schrauben,index_schraube,E40)","v":450},{"$f":"WM_ZAHLENWERT(TRIM(SUBSTITUTE(INDEX(dat_schrauben,index_schraube,F40),\"/\",\"\")))","v":{"$error":"#NAME?"}},{"$f":"IF(ISNUMBER(INDEX(dat_schrauben,index_schraube,G40)),INDEX(dat_schrauben,index_schraube,G40),0)","v":0},{"$f":"INDEX(dat_schrauben,index_schraube,H40)","v":13.1},{"$f":"'Thermal insulation'!$D$106","v":{"$error":"#NAME?"}},{"$f":"'Thermal insulation'!$D$109","v":{"$error":"#NAME?"}},{"$f":"'Thermal insulation'!$D$107","v":311.76914536239792},{"$f":"'Thermal insulation'!$D$135","v":34.641016151377549},{"$f":"'Thermal insulation'!$D$139","v":{"$error":"#NAME?"}},{"$f":"'Thermal insulation'!$D$137","v":311.76914536239792},{"$f":"fh_sverweis(L_s_dä_zug,data_ausknicken,\n   IF(vba_Schraube_d=6,2,\n       IF(vba_Schraube_d=8,3,\n            IF(vba_Schraube_d>=10,4,0))))","v":{"$error":"#NAME?"}},{"$f":"'Thermal insulation'!$D$128","v":34.641016151377549},{"$f":"'Thermal insulation'!$D$132","v":{"$error":"#NAME?"}},{"$f":"'Thermal insulation'!$D$130","v":311.76914536239792},{"$f":"fh_sverweis(L_s_dä_druck,data_ausknicken,\n   IF(vba_Schraube_d=6,2,\n       IF(vba_Schraube_d=8,3,\n            IF(vba_Schraube_d>=10,4,0))))","v":{"$error":"#NAME?"}}]
["Index 2",{"$f":"INDEX(dat_schrauben,index_schraube_2,B40)","v":"ESSVE CY-FT  8,0X400/390"},{"$f":"INDEX(dat_schrauben,index_schraube_2,C40)","v":8},{"$f":"IF(ISNUMBER(INDEX(dat_schrauben,index_schraube_2,D40)),INDEX(dat_schrauben,index_schraube_2,D40),0)","v":10.199999999999999},{"$f":"INDEX(dat_schrauben,index_schraube_2,E40)","v":400},{"$f":"WM_ZAHLENWERT(TRIM(SUBSTITUTE(INDEX(dat_schrauben,index_schraube_2,F40),\"/\",\"\")))","v":{"$error":"#NAME?"}},{"$f":"IF(ISNUMBER(INDEX(dat_schrauben,index_schraube,G40)),INDEX(dat_schrauben,index_schraube_2,G40),0)","v":0},{"$f":"INDEX(dat_schrauben,index_schraube_2,H40)","v":13.1},{"$f":"l_ef_L","v":{"$error":"#NAME?"}},{"$f":"l_ef_Uk","v":{"$error":"#NAME?"}},{"$f":"L_s_dä","v":311.76914536239792},{"$f":"l_ef_l_zug","v":34.641016151377549},{"$f":"l_ef_UK_zug","v":{"$error":"#NAME?"}},{"$f":"L_s_dä_zug","v":311.76914536239792},{"$f":"R_k","v":{"$error":"#NAME?"}},{"$f":"l_ef_L_druck","v":34.641016151377549},{"$f":"l_ef_UK_druck","v":{"$error":"#NAME?"}},{"$f":"L_s_dä_druck","v":311.76914536239792},{"$f":"R_ki_d_1","v":{"$error":"#NAME?"}}]
[]
[null,null,"data_Dacheindeckung",null,null,null,"vba_screwTypeTemp"]
[null,"Ist_Dacheindeckung","gk1",null,null,null,{"$f":"slst_screwtypes","v":{"$error":"#VALUE!"}}]
[{"$f":"MATCH('Thermal insulation'!D38,Ist_Dacheindeckung,0)","v":1},{"$f":"ml(\"lst_metal\", \"Metalldach\")","v":"Metal"},0.3]
[null,{"$f":"ml(\"lst_schin\", \"Schindeldach\")","v":"Shingles"},0.3]
[null,{"$f":"ml(\"lst_dachz\", \"Dachziegel\")","v":"tiles"},0.5]
[null,{"$f":"ml(\"lst_dachs\", \"Dachsteine\")","v":"tiles"},0.5]
[null,{"$f":"ml(\"lst_schie\", \"Schiefer\")","v":"Slate"},0.5]
[null,{"$f":"ml(\"lst_biber\", \"Biberdoppeldeckung\")","v":"Beaver double roofing"},0.75]
[null,{"$f":"ml(\"lst_freie\", \"freie Eingabe\")","v":"free input"}]
[]
[null,null,"data_Variante"]
[null,"Ist_Variante"]
[{"$f":"MATCH('Thermal insulation'!B34,Ist_Variante,0)","v":1},{"$f":"ml(\"ad_varian2\",\"Variante 2 - Druckfeste Dämmung/ nur eine Neigungsrichtung der Schrauben\")","v":"Method 2 - Hard Insulation / one direction of inclination of the screws"},{"$f":"ml(\"ad_varian3\",\"nur eine Neigungsrichtung der Schrauben\")","v":"one direction of inclination of the screws"}]
[null,{"$f":"ml(\"ad_varian1\",\"Variante 1 - Weiche Dämmung/ Abwechselnde Neigung der Schrauben\")","v":"Method 1 - Soft Insulation / changing direction of inclination of the screws"},{"$f":"ml(\"ad_varian4\",\"abwechselnde Neigung der Schrauben\")","v":"changing direction of inclination of the screws"}]
[]
[null,"Ist_sHöhe"]
[{"$f":"MATCH('Thermal insulation'!$D$45,ist_sHöhe,0)","v":2}," > 1000 m"]
[null," ≤ 1000 m"]
[null,null,"data_SchraubHart"]
[null,null,1,2,3,null,4,5,6]
[null,"Ist_SchraubHart","d [mm]","dk [mm] ","di [mm]",null,"L_Gesamt [mm]",null,"L_Gewinde [mm]"]
[{"$f":"MATCH('Thermal insulation'!B86,Ist_SchraubHart,0)","v":{"$error":"#N/A"}},"STAR DRIVE VG ZYLK.VD  8,0X140/130",8,0,null,null,140,null,"/ 130",null,true,"StarDrive Voll Gew. ","1131740801400001","080x140/130","L0L 1A1 A0E","E","T40/GELB (Essve-package)",24.1,20.3,13.1,"kein Kopfdurchzug",950,25.8,8.6999999999999993,"8,0 x 140","kein kopfdurchzug",null,"TX 40","StarDrive VOLLGEWINDE","cylinderkopf",null,"EG-Vollgewinde + VD","gelb verzinkt",null,"ETA","ETA 12/0373",14,"LE 009","1359-CPD-0519","SSH_ETA.lab","D10"]
[null,"STAR DRIVE VG ZYLK.VD  8,0X160/150",8,0,null,null,160,null,"/ 150",null,true,"StarDrive Voll Gew. ","1131740801600001","080x160/150","L0L 1A1 A0E","E","T40/GELB (Essve-package)",24.1,20.3,13.1,"kein Kopfdurchzug",950,25.8,8.6999999999999993,"8,0 x 160","kein kopfdurchzug",null,"TX 40","StarDrive VOLLGEWINDE","cylinderkopf",null,"EG-Vollgewinde + VD","gelb verzinkt",null,"ETA","ETA 12/0373",14,"LE 009","1359-CPD-0519","SSH_ETA.lab","D10"]
[null,"STAR DRIVE VG ZYLK.VD  8,0X180/170",8,0,null,null,180,null,"/ 170",null,true,"StarDrive Voll Gew. ","1131740801800001","080x180/170","L0L 1A1 A0E","E","T40/GELB (Essve-package)",24.1,20.3,13.1,"kein Kopfdurchzug",950,25.8,8.6999999999999993,"8,0 x 180","kein kopfdurchzug",null,"TX 40","StarDrive VOLLGEWINDE","cylinderkopf",null,"EG-Vollgewinde + VD","gelb verzinkt",null,"ETA","ETA 12/0373",14,"LE 009","1359-CPD-0519","SSH_ETA.lab","D10"]
[null,"STAR DRIVE VG ZYLK.VD  8,0X200/190",8,0,null,null,200,null,"/ 190",null,true,"StarDrive Voll Gew. ","1131740802000001","080x200/190","L0L 1A1 A0E","E","T40/GELB (Essve-package)",24.1,20.3,13.1,"kein Kopfdurchzug",950,25.8,8.6999999999999993,"8,0 x 200","kein kopfdurchzug",null,"TX 40","StarDrive VOLLGEWINDE","cylinderkopf",null,"EG-Vollgewinde + VD","gelb verzinkt",null,"ETA","ETA 12/0373",14,"LE 009","1359-CPD-0519","SSH_ETA.lab","D10"]
[null,"STAR DRIVE VG ZYLK.VD  8,0X220/210",8,0,null,null,220,null,"/ 210",null,true,"StarDrive Voll Gew. ","1131740802200001","080x220/210","L0L 1A1 A0E","E","T40/GELB (Essve-package)",24.1,20.3,13.1,"kein Kopfdurchzug",950,25.8,8.6999999999999993,"8,0 x 220","kein kopfdurchzug",null,"TX 40","StarDrive VOLLGEWINDE","cylinderkopf",null,"EG-Vollgewinde + VD","gelb verzinkt",null,"ETA","ETA 12/0373",14,"LE 009","1359-CPD-0519","SSH_ETA.lab","D10"]
[null,"STAR DRIVE VG ZYLK.VD  8,0X240/230",8,0,null,null,240,null,"/ 230",null,true,"StarDrive Voll Gew. ","1131740802400001","080x240/230","L0L 1A1 A0E","E","T40/GELB (Essve-package)",24.1,20.3,13.1,"kein Kopfdurchzug",950,25.8,8.6999999999999993,"8,0 x 240","kein kopfdurchzug",null,"TX 40","StarDrive VOLLGEWINDE","cylinderkopf",null,"EG-Vollgewinde + VD","gelb verzinkt",null,"ETA","ETA 12/0373",14,"LE 009","1359-CPD-0519","SSH_ETA.lab","D10"]
[null,"STAR DRIVE VG ZYLK.VD  8,0X260/250",8,0,null,null,260,null,"/ 250",null,true,"StarDrive Voll Gew. ","1131740802600001","080x260/250","L0L 1A1 A0E","E","T40/GELB (Essve-package)",24.1,20.3,13.1,"kein Kopfdurchzug",950,25.8,8.6999999999999993,"8,0 x 260","kein kopfdurchzug",null,"TX 40","StarDrive VOLLGEWINDE","cylinderkopf",null,"EG-Vollgewinde + VD","gelb verzinkt",null,"ETA","ETA 12/0373",14,"LE 009","1359-CPD-0519","SSH_ETA.lab","D10"]
[null,"STAR DRIVE VG ZYLK.VD  8,0X280/270",8,0,null,null,280,null,"/ 270",null,true,"StarDrive Voll Gew. ","1131740802800001","080x280/270","L0L 1A1 A0E","E","T40/GELB (Essve-package)",24.1,20.3,13.1,"kein Kopfdurchzug",950,25.8,8.6999999999999993,"8,0 x 280","kein kopfdurchzug",null,"TX 40","StarDrive VOLLGEWINDE","cylinderkopf",null,"EG-Vollgewinde + VD","gelb verzinkt",null,"ETA","ETA 12/0373",14,"LE 009","1359-CPD-0519","SSH_ETA.lab","D10"]
[null,"STAR DRIVE VG ZYLK.VD  8,0X300/290",8,0,null,null,300,null,"/ 290",null,true,"StarDrive Voll Gew. ","1131740803000001","080x300/290","L0L 1A1 A0E","E","T40/GELB (Essve-package)",24.1,20.3,13.1,"kein Kopfdurchzug",950,25.8,8.6999999999999993,"8,0 x 300","kein kopfdurchzug",null,"TX 40","StarDrive VOLLGEWINDE","cylinderkopf",null,"EG-Vollgewinde + VD","gelb verzinkt",null,"ETA","ETA 12/0373",14,"LE 009","1359-CPD-0519","SSH_ETA.lab","D10"]
[null,"STAR DRIVE VG ZYLK.VD  8,0X350/340",8,0,null,null,350,null,"/ 340",null,true,"StarDrive Voll Gew. ","1131740803500001","080x350/340","L0L 1A1 A0E","E","T40/GELB (Essve-package)",24.1,20.3,13.1,"kein Kopfdurchzug",950,25.8,8.6999999999999993,"8,0 x 350","kein kopfdurchzug",null,"TX 40","StarDrive VOLLGEWINDE","cylinderkopf",null,"EG-Vollgewinde + VD","gelb verzinkt",null,"ETA","ETA 12/0373",14,"LE 009","1359-CPD-0519","SSH_ETA.lab","D10"]
[null,"STAR DRIVE VG ZYLK.VD  8,0X400/390",8,0,null,null,400,null,"/ 390",null,true,"StarDrive Voll Gew. ","1131740804000001","080x400/390","L0L 1A1 A0E","E","T40/GELB (Essve-package)",24.1,20.3,13.1,"kein Kopfdurchzug",950,25.8,8.6999999999999993,"8,0 x 400","kein kopfdurchzug",null,"TX 40","StarDrive VOLLGEWINDE","cylinderkopf",null,"EG-Vollgewinde + VD","gelb verzinkt",null,"ETA","ETA 12/0373",14,"LE 009","1359-CPD-0519","SSH_ETA.lab","D10"]
[null,"STAR DRIVE VG BIRNENK. 6,0 X120/112",6,0,null,null,120,null,"/ 112",null,true,"StarDrive Voll Gew. ","1132740601200001","060x120/112","E0E 0A0 A0D","D","T30-GAL ZN GELB (Essve-package)",12.5,10,13.5,"kein Kopfdurchzug",950,10.4,6.9,"6,0 x 120","kein kopfdurchzug",null,"TX 30","StarDrive VOLLGEWINDE","Birnenkopf",null,"EG-Vollgewinde","gelb verzinkt","Z-9.1-656","ETA","ETA 12/0373",13,"LE 004","1359-CPD-0519","SSH_ETA.lab","D10"]
[null,"STAR DRIVE VG BIRNENK. 6,0 X140/132",6,0,null,null,140,null,"/ 132",null,true,"StarDrive Voll Gew. ","1132740601400001","060x140/132","E0E 0A0 A0D","D","T30-GAL ZN GELB (Essve-package)",12.5,10,13.5,"kein Kopfdurchzug",950,10.4,6.9,"6,0 x 140","kein kopfdurchzug",null,"TX 30","StarDrive VOLLGEWINDE","Birnenkopf",null,"EG-Vollgewinde","gelb verzinkt","Z-9.1-656","ETA","ETA 12/0373",13,"LE 004","1359-CPD-0519","SSH_ETA.lab","D10"]
[null,"STAR DRIVE VG BIRNENK. 6,0 X160/152",6,0,null,null,160,null,"/ 152",null,true,"StarDrive Voll Gew. ","1132740601600001","060x160/152","E0E 0A0 A0D","D","T30-GAL ZN GELB (Essve-package)",12.5,10,13.5,"kein Kopfdurchzug",950,10.4,6.9,"6,0 x 160","kein kopfdurchzug",null,"TX 30","StarDrive VOLLGEWINDE","Birnenkopf",null,"EG-Vollgewinde","gelb verzinkt","Z-9.1-656","ETA","ETA 12/0373",13,"LE 004","1359-CPD-0519","SSH_ETA.lab","D10"]
[null,"STAR DRIVE VG BIRNENK. 6,0 X180/172",6,0,null,null,180,null,"/ 172",null,true,"StarDrive Voll Gew. ","1132740601800001","060x180/172","E0E 0A0 A0D","D","T30-GAL ZN GELB (Essve-package)",12.5,10,13.5,"kein Kopfdurchzug",950,10.4,6.9,"6,0 x 180","kein kopfdurchzug",null,"TX 30","StarDrive VOLLGEWINDE","Birnenkopf",null,"EG-Vollgewinde","gelb verzinkt","Z-9.1-656, Z-9.1-509","ETA","ETA 12/0373",13,"LE 004","1359-CPD-0519","SSH_ETA.lab","D10"]
[null,"STAR DRIVE VG BIRNENK. 6,0 X200/192",6,0,null,null,200,null,"/ 192",null,true,"StarDrive Voll Gew. ","1132740602000001","060x200/192","E0E 0A0 A0D","D","T30-GAL ZN GELB (Essve-package)",12.5,10,13.5,"kein Kopfdurchzug",950,10.4,6.9,"6,0 x 200","kein kopfdurchzug",null,"TX 30","StarDrive VOLLGEWINDE","Birnenkopf",null,"EG-Vollgewinde","gelb verzinkt","Z-9.1-656, Z-9.1-509","ETA","ETA 12/0373",13,"LE 004","1359-CPD-0519","SSH_ETA.lab","D10"]
[]
[]
[null,null,"data_SchraubWeich"]
[null,null,"NAV-Bez1","DM","Kopfdurchmesser",null,"di ","Länge",null,"Gewindelänge","Vorzugstypen für Aufdach+","Zugelassen für weiche Dämmung bei Aufdach+",null,"Artikelnr","ETA Code 1","ETA Code 2","ETA-\nKennbuchstabe","NAV-Bez2","Zugtrag-\nfähigkeit [kN]","Fließ-\nmoment [Nm]","Auszieh-\nparameter [N/mm2]","Kopfdurchzieh-parameter [N/mm²]","Fließ-\ngrenze [N/mm2]","Torsions-\nfestigkeit [Nm]\n(Bruchdrehmoment)","Einschraub\ndrehmoment [Nm]","Dimension","Kopf-Art [°]","Reibteil","Antrieb","Et Text 1","Kopfgeo","Schaft","Gewinde","Oberfläche","Nummer Ü-Zeichen","ETA oder EN","ETA-Nummer","ETA-Jahreszahl","ETA-LE-Nummer","ETA-Überwachungsstelle","Etikettengröße","Programm"]
[{"$f":"MATCH('Thermal insulation'!B86,Ist_SchraubWeich,0)","v":{"$error":"#N/A"}},"Ist_SchraubWeich","d [mm]","dk [mm] ","di [mm]",null,"L_Gesamt [mm]",null,"L_Gewinde [mm]"]
[null,"STAR DRIVE VG ZYLK.VD  8,0X120/110",8,0,null,null,120,null,"/ 110",null,true,"StarDrive Voll Gew. ","1131740801200001","080x120/110","L0L 1A1 A0E","E","T40/GELB (Essve-package)",24.1,20.3,13.1,"kein Kopfdurchzug",950,25.8,8.6999999999999993,"8,0 x 120","kein kopfdurchzug",null,"TX 40","StarDrive VOLLGEWINDE","cylinderkopf",null,"EG-Vollgewinde + VD","gelb verzinkt",null,"ETA","ETA 12/0373",14,"LE 009","1359-CPD-0519","SSH_ETA.lab","D10"]
[null,"STAR DRIVE VG ZYLK.VD  8,0X140/130",8,0,null,null,140,null,"/ 130",null,true,"StarDrive Voll Gew. ","1131740801400001","080x140/130","L0L 1A1 A0E","E","T40/GELB (Essve-package)",24.1,20.3,13.1,"kein Kopfdurchzug",950,25.8,8.6999999999999993,"8,0 x 140","kein kopfdurchzug",null,"TX 40","StarDrive VOLLGEWINDE","cylinderkopf",null,"EG-Vollgewinde + VD","gelb verzinkt",null,"ETA","ETA 12/0373",14,"LE 009","1359-CPD-0519","SSH_ETA.lab","D10"]
[null,"STAR DRIVE VG ZYLK.VD  8,0X160/150",8,0,null,null,160,null,"/ 150",null,true,"StarDrive Voll Gew. ","1131740801600001","080x160/150","L0L 1A1 A0E","E","T40/GELB (Essve-package)",24.1,20.3,13.1,"kein Kopfdurchzug",950,25.8,8.6999999999999993,"8,0 x 160","kein kopfdurchzug",null,"TX 40","StarDrive VOLLGEWINDE","cylinderkopf",null,"EG-Vollgewinde + VD","gelb verzinkt",null,"ETA","ETA 12/0373",14,"LE 009","1359-CPD-0519","SSH_ETA.lab","D10"]
[null,"STAR DRIVE VG ZYLK.VD  8,0X180/170",8,0,null,null,180,null,"/ 170",null,true,"StarDrive Voll Gew. ","1131740801800001","080x180/170","L0L 1A1 A0E","E","T40/GELB (Essve-package)",24.1,20.3,13.1,"kein Kopfdurchzug",950,25.8,8.6999999999999993,"8,0 x 180","kein kopfdurchzug",null,"TX 40","StarDrive VOLLGEWINDE","cylinderkopf",null,"EG-Vollgewinde + VD","gelb verzinkt",null,"ETA","ETA 12/0373",14,"LE 009","1359-CPD-0519","SSH_ETA.lab","D10"]
[null,"STAR DRIVE VG ZYLK.VD  8,0X200/190",8,0,null,null,200,null,"/ 190",null,true,"StarDrive Voll Gew. ","1131740802000001","080x200/190","L0L 1A1 A0E","E","T40/GELB (Essve-package)",24.1,20.3,13.1,"kein Kopfdurchzug",950,25.8,8.6999999999999993,"8,0 x 200","kein kopfdurchzug",null,"TX 40","StarDrive VOLLGEWINDE","cylinderkopf",null,"EG-Vollgewinde + VD","gelb verzinkt",null,"ETA","ETA 12/0373",14,"LE 009","1359-CPD-0519","SSH_ETA.lab","D10"]
[null,"STAR DRIVE VG ZYLK.VD  8,0X220/210",8,0,null,null,220,null,"/ 210",null,true,"StarDrive Voll Gew. ","1131740802200001","080x220/210","L0L 1A1 A0E","E","T40/GELB (Essve-package)",24.1,20.3,13.1,"kein Kopfdurchzug",950,25.8,8.6999999999999993,"8,0 x 220","kein kopfdurchzug",null,"TX 40","StarDrive VOLLGEWINDE","cylinderkopf",null,"EG-Vollgewinde + VD","gelb verzinkt",null,"ETA","ETA 12/0373",14,"LE 009","1359-CPD-0519","SSH_ETA.lab","D10"]
[null,"STAR DRIVE VG ZYLK.VD  8,0X240/230",8,0,null,null,240,null,"/ 230",null,true,"StarDrive Voll Gew. ","1131740802400001","080x240/230","L0L 1A1 A0E","E","T40/GELB (Essve-package)",24.1,20.3,13.1,"kein Kopfdurchzug",950,25.8,8.6999999999999993,"8,0 x 240","kein kopfdurchzug",null,"TX 40","StarDrive VOLLGEWINDE","cylinderkopf",null,"EG-Vollgewinde + VD","gelb verzinkt",null,"ETA","ETA 12/0373",14,"LE 009","1359-CPD-0519","SSH_ETA.lab","D10"]
[null,"STAR DRIVE VG ZYLK.VD  8,0X260/250",8,0,null,null,260,null,"/ 250",null,true,"StarDrive Voll Gew. ","1131740802600001","080x260/250","L0L 1A1 A0E","E","T40/GELB (Essve-package)",24.1,20.3,13.1,"kein Kopfdurchzug",950,25.8,8.6999999999999993,"8,0 x 260","kein kopfdurchzug",null,"TX 40","StarDrive VOLLGEWINDE","cylinderkopf",null,"EG-Vollgewinde + VD","gelb verzinkt",null,"ETA","ETA 12/0373",14,"LE 009","1359-CPD-0519","SSH_ETA.lab","D10"]
[null,"STAR DRIVE VG ZYLK.VD  8,0X280/270",8,0,null,null,280,null,"/ 270",null,true,"StarDrive Voll Gew. ","1131740802800001","080x280/270","L0L 1A1 A0E","E","T40/GELB (Essve-package)",24.1,20.3,13.1,"kein Kopfdurchzug",950,25.8,8.6999999999999993,"8,0 x 280","kein kopfdurchzug",null,"TX 40","StarDrive VOLLGEWINDE","cylinderkopf",null,"EG-Vollgewinde + VD","gelb verzinkt",null,"ETA","ETA 12/0373",14,"LE 009","1359-CPD-0519","SSH_ETA.lab","D10"]
[null,"STAR DRIVE VG ZYLK.VD  8,0X300/290",8,0,null,null,300,null,"/ 290",null,true,"StarDrive Voll Gew. ","1131740803000001","080x300/290","L0L 1A1 A0E","E","T40/GELB (Essve-package)",24.1,20.3,13.1,"kein Kopfdurchzug",950,25.8,8.6999999999999993,"8,0 x 300","kein kopfdurchzug",null,"TX 40","StarDrive VOLLGEWINDE","cylinderkopf",null,"EG-Vollgewinde + VD","gelb verzinkt",null,"ETA","ETA 12/0373",14,"LE 009","1359-CPD-0519","SSH_ETA.lab","D10"]
[null,"STAR DRIVE VG ZYLK.VD  8,0X350/340",8,0,null,null,350,null,"/ 340",null,true,"StarDrive Voll Gew. ","1131740803500001","080x350/340","L0L 1A1 A0E","E","T40/GELB (Essve-package)",24.1,20.3,13.1,"kein Kopfdurchzug",950,25.8,8.6999999999999993,"8,0 x 350","kein kopfdurchzug",null,"TX 40","StarDrive VOLLGEWINDE","cylinderkopf",null,"EG-Vollgewinde + VD","gelb verzinkt",null,"ETA","ETA 12/0373",14,"LE 009","1359-CPD-0519","SSH_ETA.lab","D10"]
[null,"STAR DRIVE VG ZYLK.VD  8,0X400/390",8,0,null,null,400,null,"/ 390",null,true,"StarDrive Voll Gew. ","1131740804000001","080x400/390","L0L 1A1 A0E","E","T40/GELB (Essve-package)",24.1,20.3,13.1,"kein Kopfdurchzug",950,25.8,8.6999999999999993,"8,0 x 400","kein kopfdurchzug",null,"TX 40","StarDrive VOLLGEWINDE","cylinderkopf",null,"EG-Vollgewinde + VD","gelb verzinkt",null,"ETA","ETA 12/0373",14,"LE 009","1359-CPD-0519","SSH_ETA.lab","D10"]
[null,"STAR DRIVE VG BIRNENK. 6,0 X120/112",6,0,null,null,120,null,"/ 112",null,true,"StarDrive Voll Gew. ","1132740601200001","060x120/112","E0E 0A0 A0D","D","T30-GAL ZN GELB (Essve-package)",12.5,10,13.5,"kein Kopfdurchzug",950,10.4,6.9,"6,0 x 120","kein kopfdurchzug",null,"TX 30","StarDrive VOLLGEWINDE","Birnenkopf",null,"EG-Vollgewinde","gelb verzinkt","Z-9.1-656","ETA","ETA 12/0373",13,"LE 004","1359-CPD-0519","SSH_ETA.lab","D10"]
[null,"STAR DRIVE VG BIRNENK. 6,0 X140/132",6,0,null,null,140,null,"/ 132",null,true,"StarDrive Voll Gew. ","1132740601400001","060x140/132","E0E 0A0 A0D","D","T30-GAL ZN GELB (Essve-package)",12.5,10,13.5,"kein Kopfdurchzug",950,10.4,6.9,"6,0 x 140","kein kopfdurchzug",null,"TX 30","StarDrive VOLLGEWINDE","Birnenkopf",null,"EG-Vollgewinde","gelb verzinkt","Z-9.1-656","ETA","ETA 12/0373",13,"LE 004","1359-CPD-0519","SSH_ETA.lab","D10"]
[null,"STAR DRIVE VG BIRNENK. 6,0 X160/152",6,0,null,null,160,null,"/ 152",null,true,"StarDrive Voll Gew. ","1132740601600001","060x160/152","E0E 0A0 A0D","D","T30-GAL ZN GELB (Essve-package)",12.5,10,13.5,"kein Kopfdurchzug",950,10.4,6.9,"6,0 x 160","kein kopfdurchzug",null,"TX 30","StarDrive VOLLGEWINDE","Birnenkopf",null,"EG-Vollgewinde","gelb verzinkt","Z-9.1-656","ETA","ETA 12/0373",13,"LE 004","1359-CPD-0519","SSH_ETA.lab","D10"]
[null,"STAR DRIVE VG BIRNENK. 6,0 X180/172",6,0,null,null,180,null,"/ 172",null,true,"StarDrive Voll Gew. ","1132740601800001","060x180/172","E0E 0A0 A0D","D","T30-GAL ZN GELB (Essve-package)",12.5,10,13.5,"kein Kopfdurchzug",950,10.4,6.9,"6,0 x 180","kein kopfdurchzug",null,"TX 30","StarDrive VOLLGEWINDE","Birnenkopf",null,"EG-Vollgewinde","gelb verzinkt","Z-9.1-656, Z-9.1-509","ETA","ETA 12/0373",13,"LE 004","1359-CPD-0519","SSH_ETA.lab","D10"]
[null,"STAR DRIVE VG BIRNENK. 6,0 X200/192",6,0,null,null,200,null,"/ 192",null,true,"StarDrive Voll Gew. ","1132740602000001","060x200/192","E0E 0A0 A0D","D","T30-GAL ZN GELB (Essve-package)",12.5,10,13.5,"kein Kopfdurchzug",950,10.4,6.9,"6,0 x 200","kein kopfdurchzug",null,"TX 30","StarDrive VOLLGEWINDE","Birnenkopf",null,"EG-Vollgewinde","gelb verzinkt","Z-9.1-656, Z-9.1-509","ETA","ETA 12/0373",13,"LE 004","1359-CPD-0519","SSH_ETA.lab","D10"]
[null,null,null,null,null,null,320]
[]
[null,null,"data_Konterlatte"]
[null,"Ist_Konterlatte","fm,k [N/mm2]","E0,mean [N/mm2]"]
[null,"C24",24,11000]
[null,"C27",27,11500]
[{"$f":"MATCH(Fest_KL,ist_KL,0)","v":1},"C30",30,12000]
[null,"C35",35,13000]
[]
[]
[]
[]
[null,"Freie Schraubenlänge l \n[mm]","Bemessungswert der Tragfähigkeit der Schrauben auf\n Ausknicken Rki,d in KN"]
[null,null,"d= 6 mm","d= 8 mm","d= 10 mm"]
[null,0,1.52,5.17,9.51]
[null,80,1.52,5.17,9.51]
[null,100,1.1000000000000001,3.83,7.2]
[null,120,0.83,2.93,5.59]
[null,140,0.65,2.31,4.4400000000000004]
[null,160,0.52,1.87,3.61]
[null,180,0.42,1.54,2.98,null,null,"l vorh"]
[null,200,0.35,1.29,2.5099999999999998,null,null,200,{"$f":"fh_sverweis(H127,data_ausknicken,4)","v":2.5099999999999998}]
[null,220,0.3,1.1000000000000001,2.14]
[null,240,0.26,0.94,1.84]
[null,260,0.22,0.82,1.6]
[null,280,0.19,0.72,1.41]
[null,300,0.17,0.63,1.25]
[null,320,null,0.56999999999999995,1.1100000000000001]
[null,340,null,0.51,1]
[null,360,null,0.46,0.9]
[null,380,null,0.41,0.81]
[null,400,null,0.38,0.74]
[null,420,null,0.34,0.68]
[null,440,null,0.32,0.62]
[null,460,null,0.28999999999999998,0.56999999999999995]
[null,480,null,0.27,0.53]
[null,500,null,0.25,0.49]
[null,520,null,0.23,0.46]
[null,540,null,0.22,0.43]
[]
[]
[]
[null,"Ist_Dachform_1"]
[null,{"$f":"ml(\"ad_satteldach\",\"Satteldach\")","v":"double pitched"}]
[null,{"$f":"ml(\"ad_pultdach\",\"Pultdach\")","v":"single pitched / flat"}]
[]
[]
[]
[null,{"$f":"ml(\"ad_konter_grundl\",\"Konterlatte / Grundlatte (GL)\")","v":"Counter-batten"}]
[null,{"$f":"ml(\"ad_dämm1\",\"Druckfeste Dämmung\")","v":"Hard Insulation"},null,{"$f":"ml(\"ad_dämm2\",\"Weiche Dämmung\")","v":"Soft Insulation"}]
[null,{"$f":"ml(\"ad_schalu\",\"Schalung\")","v":"Formwork"}]
[null,{"$f":"ml(\"ad_unterkonstr\",\"Unterkonstruktion\")","v":"sub construction"}]
[]
[null,"Ist_ScrewPos","tf"]
[{"$f":"MATCH(wahl_ScrewPos,Ist_ScrewPos,0)","v":2},{"$f":"ml(\"lst_sp_1\",\"Kopf Versenkt\")","v":"Head sunken"},0]
[null,{"$f":"ml(\"lst_sp_2\",\"Kopf nicht Versenkt\")","v":"Head not countersunk"},-12]
[null,{"$f":"ml(\"lst_sp_3\",\"Nur bis Gewindestart eingeschraubt\")","v":"Only screwed in up to threaded start"},-20]
[null,{"$f":"ml(\"lst_sp_4\",\"Sonstige\")","v":"Other"},10]
[]
[]
[null,"vba_langindex",2]
[null,"vba_codeindex",5]

{"sheet":"calc soft_2","index":10,"n_rows":71,"n_cols":18,"rows_kept":71,"cut":false,"hidden":true,"merged":[]}
["Unendliche Konterlatte/Grundlatte mit zwei unterschiedlich geneigten Schrauben"]
["Für die Berechnung von Konterlatten mit druckweichen Dämmungen und für die Berechnung von Windsogkräften bei druckfesten Dämmungen"]
[null,"q d",{"$f":"qd_schräg","v":0.31083749999999999},"KN/m"]
[null,"beta",{"$f":"beta","v":90},"°"]
["Einwirkungen"]
["LF 1","q _|_",{"$f":"C3*COS(RADIANS(C4))","v":1.9041104142632909E-17},"kN/m","quer zur Konterlatte/Grundlatte"]
["LF 2","q //",{"$f":"-C3*SIN(RADIANS(C4))","v":-0.31083749999999999},"kN/m","in Richtung der Konterlatte/Grundlatte",null,null,null,null,{"$f":"q_DLT","v":1.9041104142632909E-17}]
[]
["Längen an der Konterlatte/Grundlatte"]
[null,"l1",{"$f":"abstand_b/100","v":0.05},"m","kurzes Feld (in Zulassung als B bezeichnet <= 50 mm)"]
[null,"l2",{"$f":"abstand_a/100","v":1.75},"m","langes Feld (in Zulassung als A bezeichnet)"]
["Dämmung und Schraubenneigungen"]
[null,"h D",{"$f":"vba_dDAE/10","v":27},"cm","Höhe der Dämmung (und allfälliger Schalung)"]
[null,"alpha 1",{"$f":"alpha_1_weich","v":60},"°","Neigung der Talschraube gegenüber dem Sparren"]
[null,"alpha 2",{"$f":"alpha_2_weich","v":60},"°","Neigung der Bergschraube gegenüber dem Sparren"]
[]
["Ergebnisse q _|_"]
["Schraubenkräfte"]
[null,"A",{"$f":"N31","v":-1.9788095884350257E-17},"kN","Normalkraft Talschraube"]
[null,"B",{"$f":"N32","v":-1.9788095884350257E-17},"kN","Normalkraft Bergschraube"]
["Momente"]
[null,"M 1",{"$f":"N34","v":2.5645987142108695E-18},"kNm"]
[null,"M 2",{"$f":"N35","v":-4.7245739653907907E-18},"kNm",null,null,null,null,null,null,null,null,"Statisch unbestimmte Rechnung - Symmetrisches Teilsystem"]
[null,"M 3",{"$f":"N36","v":-4.7245739653907907E-18},"kNm"]
[null,"M 4",{"$f":"N37","v":2.5645987142108695E-18},"kNm",null,null,null,null,null,null,null,null,"M X1=1",1,"kNm","EI · δ 1,1",{"$f":"l1_DLT+l2_DLT","v":1.8}]
[]
["Durchbiegung am Modell des Durchlaufträgers ohne geneigte Schrauben",null,null,null,null,null,null,null,null,null,null,null,"M 1,0",{"$f":"-q_DLT*((l1_DLT+l2_DLT-C48)^2/2-C48^2/2)","v":0},"kNm"]
[null,"EI w",{"$f":"((l2_DLT^4+4*l1_DLT*l2_DLT^3-4*l1_DLT^2*l2_DLT^2)*q_DLT)/384","v":5.1669604254884682E-19},"kNm³","EI-facher Wert der Durchbiegung (Durchlaufträger)",null,null,null,null,null,null,null,"M 2,0",{"$f":"N27-q_DLT*(l2_DLT/2)^2/2","v":-7.2891726796016602E-18},"kNm"]
[null,null,null,null,null,null,null,null,null,null,null,null,"M 3,0",{"$f":"-q_DLT*(l2_DLT/2)^2/2","v":-7.2891726796016602E-18},"kNm","EI · δ 1,0",{"$f":"1/2*l2_DLT/2*(N27+N28)+1/2*l1_DLT*(N28+N29)+1/2*l2_DLT/2*(N29+0)+2/3*l2_DLT*q_DLT*(l2_DLT/2)^2/8+2/3*l1_DLT*q_DLT*l1_DLT^2/8","v":-4.616277685579565E-18}]
[]
[null,null,null,null,null,null,null,null,null,null,null,null,"A 0",{"$f":"-((COS(RADIANS(alpha_2_DLT))*l1_DLT+COS(RADIANS(alpha_2_DLT))*l2_DLT)*q_DLT)/(COS(RADIANS(alpha_1_DLT))*SIN(RADIANS(alpha_2_DLT))+SIN(RADIANS(alpha_1_DLT))*COS(RADIANS(alpha_2_DLT)))","v":-1.9788095884350257E-17},"kN"]
[null,null,null,null,null,null,null,null,null,null,null,null,"B 0",{"$f":"-((COS(RADIANS(alpha_1_DLT))*l1_DLT+COS(RADIANS(alpha_1_DLT))*l2_DLT)*q_DLT)/(COS(RADIANS(alpha_1_DLT))*SIN(RADIANS(alpha_2_DLT))+SIN(RADIANS(alpha_1_DLT))*COS(RADIANS(alpha_2_DLT)))","v":-1.9788095884350257E-17},"kN","X 1 = M 4",{"$f":"-Q29/Q25","v":2.5645987142108695E-18},"kNm"]
[]
[null,null,null,null,null,null,null,null,null,null,null,null,"M 1,endg",{"$f":"$N$25*$Q$32+N27","v":2.5645987142108695E-18},"kNm"]
[null,null,null,null,null,null,null,null,null,null,null,null,"M 2,endg",{"$f":"$N$25*$Q$32+N28","v":-4.7245739653907907E-18},"kNm"]
[null,null,null,null,null,null,null,null,null,null,null,null,"M 3,endg",{"$f":"$N$25*$Q$32+N29","v":-4.7245739653907907E-18},"kNm"]
[null,null,null,null,null,null,null,null,null,null,null,null,"M 4,endg",{"$f":"$N$25*$Q$32+N30","v":2.5645987142108695E-18},"kNm"]
[]
[]
[]
[]
["Ergebnisse q //"]
[]
[null,"x 1",{"$f":"h_D_DLT/TAN(RADIANS(alpha_1_DLT))","v":15.588457268119901},"cm"]
[null,"x 2",{"$f":"h_D_DLT/TAN(RADIANS(alpha_2_DLT))","v":15.588457268119901},"cm",null,null,null,null,null,null,null,null,"Statisch unbestimmte Rechnung - Antimetrisches Teilsystem"]
[]
[null,"e 2",{"$f":"l1_DLT+(C44+C45)/100","v":0.36176914536239801},"m","Abstand der Einschraubpunkte",null,null,null,null,null,null,null,"C X1=1",{"$f":"(l2_DLT+l1_DLT-C48)/C48","v":1},"kN","δ 1,1",{"$f":"1/3*l2_DLT/2*(N47*l2_DLT/2)^2+1/3*l2_DLT/2*(l2_DLT/2)^2+1/3*l1_DLT*((N47*l2_DLT/2)^2+(N47*l2_DLT/2)*(l2_DLT/2)+(l2_DLT/2)^2)","v":0.48489583333333325}]
[null,"e P",{"$f":"l2_DLT/2+l1_DLT*SIN(RADIANS(alpha_2_DLT))*COS(RADIANS(alpha_1_DLT))/SIN(RADIANS(180-alpha_1_DLT-alpha_2_DLT))","v":0.9},"m","hor. Abstand zum Schnittpunkt der Schraubenwirkungslinien",null,null,null,null,null,null,null,"B X1=1",{"$f":"((l2_DLT/2+l1_DLT)-N47*l2_DLT/2)*1/C50","v":1.1547005383792526},"kN"]
[null,"f P",{"$f":"l1_DLT*SIN(RADIANS(alpha_2_DLT))*SIN(RADIANS(alpha_1_DLT))/SIN(RADIANS(180-alpha_1_DLT-alpha_2_DLT))","v":4.3301270189221933E-2},"m","vert. Abstand zum Schnittpunkt der Schraubenwirkungslinien",null,null,null,null,null,null,null,"A X1=1",{"$f":"N48*COS(RADIANS(alpha_2_DLT))/COS(RADIANS(alpha_1_DLT))","v":1.1547005383792526},"kN"]
[null,"n A",{"$f":"l1_DLT*SIN(RADIANS(alpha_2_DLT))","v":4.3301270189221933E-2},"m","Normalabstand der Schraube B zu A",null,null,null,null,null,null,null,"M 2,X1=1",{"$f":"N47*l2_DLT/2","v":0.875},"kNm"]
["Schraubenkräfte"]
[null,"A",{"$f":"N59","v":-0.55950749999999982},"kN","Normalkraft Talschraube",null,null,null,null,null,null,null,"C 0",{"$f":"C7*(l1_DLT+l2_DLT)*C49/C48","v":-2.6919317144884543E-2},"kN","δ 1,0",{"$f":"1/3*l2_DLT/2*N47*l2_DLT/2*N52*l2_DLT/2+1/6*l1_DLT*(N47*l2_DLT+l2_DLT/2)*N52*l2_DLT/2","v":-6.5265323598665383E-3}]
[null,"B",{"$f":"N58","v":0.55950750000000005},"kN","Normalkraft Bergschraube",null,null,null,null,null,null,null,"B 0",{"$f":"-N52*l2_DLT/2/C50","v":0.54396562500000001},"kN"]
["Momente",null,null,null,null,null,null,null,null,null,null,null,"A 0",{"$f":"(C7*(l1_DLT+l2_DLT)+N53*COS(RADIANS(alpha_2_DLT)))/COS(RADIANS(alpha_1_DLT))","v":-0.57504937499999986},"kN"]
[null,"M 1",0,"kNm",null,null,null,null,null,null,null,null,"M 2,0",{"$f":"N52*l2_DLT/2","v":-2.3554402501773975E-2},"kNm"]
[null,"M 2",{"$f":"N60","v":-1.1777201250886988E-2},"kNm"]
[null,"M 3",{"$f":"Q57*l2_DLT/2","v":1.1777201250886988E-2},"kNm",null,null,null,null,null,null,null,null,"C endg",{"$f":"N47*$Q$57+N52","v":-1.3459658572442272E-2},"kN","X 1 = D",{"$f":"-Q52/Q47","v":1.3459658572442272E-2},"kN"]
[null,"M 4",0,"kNm",null,null,null,null,null,null,null,null,"B endg",{"$f":"N48*$Q$57+N53","v":0.55950750000000005},"kN"]
[null,null,null,null,null,null,null,null,null,null,null,null,"A endg",{"$f":"N49*$Q$57+N54","v":-0.55950749999999982},"kN"]
[null,null,null,null,null,null,null,null,null,null,null,null,"M 2,endg",{"$f":"N50*$Q$57+N55","v":-1.1777201250886988E-2},"kNm"]
["GESAMT - Summe aus q // und q _|_ "]
["Design Werte"]
[null,"A d",{"$f":"C19+C52","v":-0.55950749999999982},"kN",null,"geprüft, 21.3.16"]
[null,"B d",{"$f":"C20+C53","v":0.55950750000000005},"kN",null,"geprüft, 21.3.16"]
[]
[null,"M 1,d",{"$f":"C22+C55","v":2.5645987142108695E-18},"kNm",null,"geprüft, 21.3.16"]
[null,"M 2,d",{"$f":"C23+C56","v":-1.1777201250886993E-2},"kNm",null,"geprüft, 21.3.16"]
[null,"M 3,d",{"$f":"C24+C57","v":1.1777201250886982E-2},"kNm",null,"geprüft, 21.3.16"]
[null,"M 4,d",{"$f":"C25+C58","v":2.5645987142108695E-18},"kNm",null,"geprüft, 21.3.16"]
[]
[null,"|M max,d|",{"$f":"MAX(ABS(C66),ABS(C67),ABS(C68),ABS(C69))","v":1.1777201250886993E-2}]

{"sheet":"calc soft_suction_2","index":11,"n_rows":71,"n_cols":18,"rows_kept":71,"cut":false,"hidden":true,"merged":[]}
["Unendliche Konterlatte/Grundlatte mit zwei unterschiedlich geneigten Schrauben"]
["Für die Berechnung von Konterlatten/Grundlatten mit druckweichen Dämmungen und für die Berechnung von Windsogkräften bei druckfesten Dämmungen"]
[null,"q d",{"$f":"qd_schräg_sog","v":-1.7712038894252522},"KN/m"]
[null,"beta",{"$f":"beta","v":90},"°"]
["Einwirkungen"]
["LF 1","q _|_",{"$f":"C3*COS(RADIANS(C4))","v":-1.084993854228743E-16},"kN/m","quer zur Konterlatte/Grundlatte"]
["LF 2","q //",{"$f":"-Lastkombinationen!C45*(vba_g2k+vba_g3k)*b_e*SIN(RADIANS(C4))","v":-4.5224999999999994E-2},"kN/m","in Richtung der Konterlatte/Grundlatte"]
[]
["Längen an der Konterlatte/Grundlatte"]
[null,"l1",{"$f":"abstand_b/100","v":0.05},"m","kurzes Feld (in Zulassung als B bezeichnet <= 50 mm)"]
[null,"l2",{"$f":"abstand_a/100","v":1.75},"m","langes Feld (in Zulassung als A bezeichnet)"]
["Dämmung und Schraubenneigungen"]
[null,"h D",{"$f":"vba_dDAE/10","v":27},"cm","Höhe der Dämmung (und allfälliger Schalung)"]
[null,"alpha 1",{"$f":"alpha_1_weich","v":60},"°","Neigung der Talschraube gegenüber dem Sparren"]
[null,"alpha 2",{"$f":"alpha_2_weich","v":60},"°","Neigung der Bergschraube gegenüber dem Sparren"]
[]
["Ergebnisse q _|_"]
["Schraubenkräfte"]
[null,"A",{"$f":"N31","v":1.127558688854498E-16},"kN","Normalkraft Talschraube"]
[null,"B",{"$f":"N32","v":1.127558688854498E-16},"kN","Normalkraft Bergschraube"]
["Momente"]
[null,"M 1",{"$f":"N34","v":-1.4613510974143382E-17},"kNm"]
[null,"M 2",{"$f":"N35","v":2.6921410008050686E-17},"kNm",null,null,null,null,null,null,null,null,"Statisch unbestimmte Rechnung - Symmetrisches Teilsystem"]
[null,"M 3",{"$f":"N36","v":2.6921410008050686E-17},"kNm"]
[null,"M 4",{"$f":"N37","v":-1.4613510974143382E-17},"kNm",null,null,null,null,null,null,null,null,"M X1=1",1,"kNm","EI · δ 1,1",{"$f":"l1_DLT+l2_DLT","v":1.8}]
[]
["Durchbiegung am Modell des Durchlaufträgers ohne geneigte Schrauben",null,null,null,null,null,null,null,null,null,null,null,"M 1,0",{"$f":"-q_DLT*((l1_DLT+l2_DLT-C48)^2/2-C48^2/2)","v":0},"kNm"]
[null,"EI w",{"$f":"((l2_DLT^4+4*l1_DLT*l2_DLT^3-4*l1_DLT^2*l2_DLT^2)*q_DLT)/384","v":-2.9442201800399024E-18},"kNm³","EI-facher Wert der Durchbiegung (Durchlaufträger)",null,null,null,null,null,null,null,"M 2,0",{"$f":"N27-q_DLT*(l2_DLT/2)^2/2","v":4.1534920982194069E-17},"kNm"]
[null,null,null,null,null,null,null,null,null,null,null,null,"M 3,0",{"$f":"-q_DLT*(l2_DLT/2)^2/2","v":4.1534920982194069E-17},"kNm","EI · δ 1,0",{"$f":"1/2*l2_DLT/2*(N27+N28)+1/2*l1_DLT*(N28+N29)+1/2*l2_DLT/2*(N29+0)+2/3*l2_DLT*q_DLT*(l2_DLT/2)^2/8+2/3*l1_DLT*q_DLT*l1_DLT^2/8","v":2.6304319753458086E-17}]
[]
[null,null,null,null,null,null,null,null,null,null,null,null,"A 0",{"$f":"-((COS(RADIANS(alpha_2_DLT))*l1_DLT+COS(RADIANS(alpha_2_DLT))*l2_DLT)*q_DLT)/(COS(RADIANS(alpha_1_DLT))*SIN(RADIANS(alpha_2_DLT))+SIN(RADIANS(alpha_1_DLT))*COS(RADIANS(alpha_2_DLT)))","v":1.127558688854498E-16},"kN"]
[null,null,null,null,null,null,null,null,null,null,null,null,"B 0",{"$f":"-((COS(RADIANS(alpha_1_DLT))*l1_DLT+COS(RADIANS(alpha_1_DLT))*l2_DLT)*q_DLT)/(COS(RADIANS(alpha_1_DLT))*SIN(RADIANS(alpha_2_DLT))+SIN(RADIANS(alpha_1_DLT))*COS(RADIANS(alpha_2_DLT)))","v":1.127558688854498E-16},"kN","X 1 = M 4",{"$f":"-Q29/Q25","v":-1.4613510974143382E-17},"kNm"]
[]
[null,null,null,null,null,null,null,null,null,null,null,null,"M 1,endg",{"$f":"$N$25*$Q$32+N27","v":-1.4613510974143382E-17},"kNm"]
[null,null,null,null,null,null,null,null,null,null,null,null,"M 2,endg",{"$f":"$N$25*$Q$32+N28","v":2.6921410008050686E-17},"kNm"]
[null,null,null,null,null,null,null,null,null,null,null,null,"M 3,endg",{"$f":"$N$25*$Q$32+N29","v":2.6921410008050686E-17},"kNm"]
[null,null,null,null,null,null,null,null,null,null,null,null,"M 4,endg",{"$f":"$N$25*$Q$32+N30","v":-1.4613510974143382E-17},"kNm"]
[]
[]
[]
[]
["Ergebnisse q //"]
[]
[null,"x 1",{"$f":"h_D_DLT/TAN(RADIANS(alpha_1_DLT))","v":15.588457268119901},"cm"]
[null,"x 2",{"$f":"h_D_DLT/TAN(RADIANS(alpha_2_DLT))","v":15.588457268119901},"cm",null,null,null,null,null,null,null,null,"Statisch unbestimmte Rechnung - Antimetrisches Teilsystem"]
[]
[null,"e 2",{"$f":"l1_DLT+(C44+C45)/100","v":0.36176914536239801},"m","Abstand der Einschraubpunkte",null,null,null,null,null,null,null,"C X1=1",{"$f":"(l2_DLT+l1_DLT-C48)/C48","v":1},"kN","δ 1,1",{"$f":"1/3*l2_DLT/2*(N47*l2_DLT/2)^2+1/3*l2_DLT/2*(l2_DLT/2)^2+1/3*l1_DLT*((N47*l2_DLT/2)^2+(N47*l2_DLT/2)*(l2_DLT/2)+(l2_DLT/2)^2)","v":0.48489583333333325}]
[null,"e P",{"$f":"l2_DLT/2+l1_DLT*SIN(RADIANS(alpha_2_DLT))*COS(RADIANS(alpha_1_DLT))/SIN(RADIANS(180-alpha_1_DLT-alpha_2_DLT))","v":0.9},"m","hor. Abstand zum Schnittpunkt der Schraubenwirkungslinien",null,null,null,null,null,null,null,"B X1=1",{"$f":"((l2_DLT/2+l1_DLT)-N47*l2_DLT/2)*1/C50","v":1.1547005383792526},"kN"]
[null,"f P",{"$f":"l1_DLT*SIN(RADIANS(alpha_2_DLT))*SIN(RADIANS(alpha_1_DLT))/SIN(RADIANS(180-alpha_1_DLT-alpha_2_DLT))","v":4.3301270189221933E-2},"m","vert. Abstand zum Schnittpunkt der Schraubenwirkungslinien",null,null,null,null,null,null,null,"A X1=1",{"$f":"N48*COS(RADIANS(alpha_2_DLT))/COS(RADIANS(alpha_1_DLT))","v":1.1547005383792526},"kN"]
[null,"n A",{"$f":"l1_DLT*SIN(RADIANS(alpha_2_DLT))","v":4.3301270189221933E-2},"m","Normalabstand der Schraube B zu A",null,null,null,null,null,null,null,"M 2,X1=1",{"$f":"N47*l2_DLT/2","v":0.875},"kNm"]
["Schraubenkräfte"]
[null,"A",{"$f":"N59","v":-8.1404999999999964E-2},"kN","Normalkraft Talschraube",null,null,null,null,null,null,null,"C 0",{"$f":"C7*(l1_DLT+l2_DLT)*C49/C48","v":-3.9165998886151231E-3},"kN","δ 1,0",{"$f":"1/3*l2_DLT/2*N47*l2_DLT/2*N52*l2_DLT/2+1/6*l1_DLT*(N47*l2_DLT+l2_DLT/2)*N52*l2_DLT/2","v":-9.4957148341163523E-4}]
[null,"B",{"$f":"N58","v":8.1404999999999991E-2},"kN","Normalkraft Bergschraube",null,null,null,null,null,null,null,"B 0",{"$f":"-N52*l2_DLT/2/C50","v":7.9143749999999985E-2},"kN"]
["Momente",null,null,null,null,null,null,null,null,null,null,null,"A 0",{"$f":"(C7*(l1_DLT+l2_DLT)+N53*COS(RADIANS(alpha_2_DLT)))/COS(RADIANS(alpha_1_DLT))","v":-8.366624999999997E-2},"kN"]
[null,"M 1",0,"kNm",null,null,null,null,null,null,null,null,"M 2,0",{"$f":"N52*l2_DLT/2","v":-3.4270249025382328E-3},"kNm"]
[null,"M 2",{"$f":"N60","v":-1.7135124512691164E-3},"kNm"]
[null,"M 3",{"$f":"Q57*l2_DLT/2","v":1.7135124512691164E-3},"kNm",null,null,null,null,null,null,null,null,"C endg",{"$f":"N47*$Q$57+N52","v":-1.9582999443075615E-3},"kN","X 1 = D",{"$f":"-Q52/Q47","v":1.9582999443075615E-3},"kN"]
[null,"M 4",0,"kNm",null,null,null,null,null,null,null,null,"B endg",{"$f":"N48*$Q$57+N53","v":8.1404999999999991E-2},"kN"]
[null,null,null,null,null,null,null,null,null,null,null,null,"A endg",{"$f":"N49*$Q$57+N54","v":-8.1404999999999964E-2},"kN"]
[null,null,null,null,null,null,null,null,null,null,null,null,"M 2,endg",{"$f":"N50*$Q$57+N55","v":-1.7135124512691164E-3},"kNm"]
["GESAMT - Summe aus q // und q _|_ "]
["Design Werte"]
[null,"A d",{"$f":"C52+C19","v":-8.1404999999999852E-2},"KN",null,"geprüft, 21.3.16"]
[null,"B d",{"$f":"C53+C20","v":8.1405000000000102E-2},"KN",null,"geprüft, 21.3.16"]
[]
[null,"M 1,d",{"$f":"C22+C55","v":-1.4613510974143382E-17},"kNm",null,"geprüft, 21.3.16"]
[null,"M 2,d",{"$f":"C23+C56","v":-1.7135124512690895E-3},"kNm",null,"geprüft, 21.3.16"]
[null,"M 3,d",{"$f":"C24+C57","v":1.7135124512691433E-3},"kNm",null,"geprüft, 21.3.16"]
[null,"M 4,d",{"$f":"C25+C58","v":-1.4613510974143382E-17},"kNm",null,"geprüft, 21.3.16"]
[]
[null,"|M max,d|",{"$f":"MAX(ABS(C66),ABS(C67),ABS(C68),ABS(C69))","v":1.7135124512691433E-3},"kNm"]

{"sheet":"Listen_Wind + Schnee","index":12,"n_rows":124,"n_cols":13,"rows_kept":124,"cut":false,"hidden":true,"merged":[[1,1,1,10],[2,1,2,4],[2,5,2,8],[2,9,2,10],[14,1,14,10],[15,0,16,0],[15,1,15,4],[15,5,15,8],[15,9,15,10],[2,0,3,0]]}
[]
[null,"Druckbeiwerte Satteldach (B 1991-1-4)"]
["Neigungswinkel [°]","Außendruckbeiwerte cpe,1 negativ (Sog)",null,null,null,"Außendruckbeiwerte cpe,1 positiv (Druck)",null,null,null,"Innendruckbeiwerte\n(für alle Bereiche)"]
[null,"H,I","G","J","F","H,I","G","J","F","cpi (Sog)","cpi (Druck)"]
[0,-1.2,-2,-0.6,-2.5,0,0,0.2,0,-0.3,0.2]
[5,-1.2,-2,-0.6,-2.5,0,0,0.2,0]
[15,-1.2,-2,-1.5,-2,0.2,0.2,0,0.2,null,null,null,{"$f":"(D5+D7)/2","v":-1.05}]
[30,-1.2,-2,-0.5,-1.5,0.4,0.7,0,0.7]
[45,-1.2,-2,-0.3,-1.5,0.6,0.7,0,0.7]
[60,-1,-2,-0.3,-1.5,0.7,0.7,0,0.7]
[75,-1,-2,-0.3,-1.5,0,0.8,0,0.8]
[90,-1,-2,-0.3,-1.5,0,0.8,0,0.8]
[]
[]
[null,"Druckbeiwerte Pultdach (B 1991-1-4)"]
["Neigungswinkel [°]","Außendruckbeiwerte cpe,1 negativ (Sog)",null,null,null,"Außendruckbeiwerte cpe,1 positiv (Druck)",null,null,null,"Innendruckbeiwerte\n(für alle Bereiche)"]
[null,"H,I","G","-","F","H,I","G","-","F","cpi (Sog)","cpi (Druck)"]
[0,-1.2,-2,null,-2.6,0,0,null,0,-0.3,0.2]
[5,-1.2,-2,null,-2.6,0,0,null,0]
[15,-1.2,-2.5,null,-2.9,0.2,0.2,null,0.2]
[30,-1.3,-2,null,-2.9,0.4,0.7,null,0.7]
[45,-1.3,-2,null,-2.4,0.6,0.7,null,0.7]
[60,-1.3,-2,null,-2,0.7,0.7,null,0.7]
[75,-1.3,-2,null,-2,0.8,0.8,null,0.8]
[90,-1.3,-2,null,-2,0.8,0.8,null,0.8]
[]
[]
[]
[]
[]
[]
[]
[]
[null,"lst_Dachform"]
[{"$f":"MATCH(Location!E12,Ist_Dachform,0)","v":2},{"$f":"ml(\"ad_satteldach\",\"Satteldach\")","v":"double pitched"}]
[null,{"$f":"ml(\"ad_pultdach\",\"Pultdach\")","v":"single pitched / flat"}]
[]
[]
[]
[null,"Ist_GK","data_GK","z0","z min"]
[{"$f":"MATCH(Location!D34,Liste_Gelaende,0)","v":2},"0",{"$f":"ml(\"ad_seacoast\",\"Sea or coastal area exposed to the open sea\")","v":"Sea or coastal area exposed to the open sea"},3.0000000000000001E-3,1,{"$f":"wind_K_I/(wind_c_0*LN(E41/D41))","v":0.17214243162328191}]
[null,"I",{"$f":"ml(\"ad_lakes\",\"Areas at lakes or flat terrain with negligible vegetation and no obstacles\")","v":"Areas at lakes or flat terrain with negligible vegetation and no obstacles"},0.01,1,{"$f":"wind_K_I/(wind_c_0*LN(E42/D42))","v":0.21714724095162588}]
[null,"II",{"$f":"ml(\"ad_g1\",\"Gebiete mit niedriger Vegetation wie Gras und einzelne Hindernisse (Bäume, Gebäude) mit Abständen von min. 20-facher Hindernishöhe\")","v":"Areas with low vegetation such as grass and individual obstacles (trees, buildings) with distances of at least 20 times the height of the obstacle."},0.05,2,{"$f":"wind_K_I/(wind_c_0*LN(E43/D43))","v":0.27108503068181677}]
[null,"III",{"$f":"ml(\"ad_g2\",\"Gebiete mit gleichmäßiger Vegetation oder Bebauung oder mit einzelnen Objekten mit Abständen von weniger als der 20-fachen Hindernishöhe (z.B. Dörfer, vorstäditsche Bebauung, Waldgebiete\")","v":"Areas with uniform vegetation or buildings or with individual objects with distances of less than 20 times the obstacle height (e.g. villages, suburban development, forest areas)"},0.3,5,{"$f":"wind_K_I/(wind_c_0*LN(E44/D44))","v":0.35544046023668174}]
[null,"IV",{"$f":"ml(\"ad_g3\",\"Gebiete, in denen mindestens 15% der Oberfläche mit Gebäuden mit einer mittleren Höhe größer als 15 m bebaut sind\")","v":"Areas where at least 15% of the surface area is covered with buildings with an average height greater than 15 m"},1,10,{"$f":"wind_K_I/(wind_c_0*LN(E45/D45))","v":0.43429448190325176}]
[]
[null,"lst_Country"]
[1,"Österreich (AT)"]
[null,"Deutschland (DE)"]
[]
[null,null,"data_Standort"]
[null,"Ist_Standort","qb [KN/m2]","sk [KN/m2"]
[{"$f":"MATCH(Location!E7,Ist_Standort,0)","v":{"$error":"#N/A"}},"Wien (1. Bezirk)",0.39,1.35]
[null,"Eisenstadt",0.38,1.1000000000000001]
[null,"Klagenfurt",0.19,2.65]
[null,"St. Pölten",0.42,1.45]
[null,"Linz",0.47,1.45]
[null,"Salzburg (Zentrum)",0.39,1.75]
[null,"Graz (Zentrum)",0.26,1.65]
[null,"Innsbruck",0.46,2.1]
[null,"Bregenz",0.41,2.1]
[null,"Selbstangabe","-"]
[]
[]
[null,"Abmessungen Satteldach + Pultdach_ WIND"]
[null,"Sparrenlänge","b 1",{"$f":"Location!$E$15","v":9.8000000000000007},"m"]
[null,"Traufenlänge","b 2",{"$f":"Location!$E$16","v":12},"m"]
[null,"Höhe über Grund (Firsthöhe)","z",{"$f":"z_wind","v":9},"m"]
[]
[null,"Wind θ=0°","e 1",{"$f":"MIN(D66,2*D68)","v":9.8000000000000007},"m"]
[null,"Wind θ=90°","e 2 ",{"$f":"MIN(D67,2*D68)","v":12},"m"]
[]
[null,"max(e1 /4 ; e2 / 10)","e 1, satteldach",{"$f":"MAX(D70/4,D71/10)","v":2.4500000000000002},"m"]
[null,"max(e2 /4 ; e1 / 10)","e 2, satteldach",{"$f":"MAX(D71/4,D70/10)","v":3},"m"]
[]
[null,"b1 - 2*e1_satteldach",null,{"$f":"D66-2*D73","v":4.9000000000000004},"m"]
[null,"b2 - 2*e2_satteldach",null,{"$f":"D67-2*D74","v":6},"m"]
[]
[null,"Bereich J",null,{"$f":"IF(index_Dachform=1,D71/10*2,\"\")","v":""},"m"]
[null,"Bereich H, I",null,{"$f":"IF(index_Dachform=1,D66/2-e1_satteldach-D79/2,\"\")","v":""},"m"]
[]
[]
[null,"Bereich F",null,{"$f":"e1_satteldach*e2_satteldach*4","v":29.400000000000002},"m2"]
[null,"Bereich G",null,{"$f":"D76*e2_satteldach*2+D77*e1_satteldach*2","v":58.800000000000004},"m2"]
[null,"Bereich H,I",null,{"$f":"IF(index_Dachform=1,D76*D77-D86,D76*D77)","v":29.400000000000002},"m2"]
[null,"Bereich J",null,{"$f":"D79*D77","v":{"$error":"#VALUE!"}},"m2"]
[]
[]
[]
[]
[]
[]
[]
[]
[]
[]
[null,"Ist_Schneegitter"]
[{"$f":"MATCH(Location!E25,Ist_Schneegitter,0)","v":1},{"$f":"ml(\"lst_JA\",\"JA\")","v":"YES"}]
[null,{"$f":"ml(\"lst_NEIN\",\"NEIN\")","v":"NO"}]
[]
[null,"Deutschland"]
[null,null,"Data_GK2",null,"h (bzw. z)"]
[null,"Ist_GK2",10,"10-18","18-25",">25"]
[null,"1 (Binnenland)",0.5,0.65,0.75,"-"]
[null,"2 (Binnenland)",0.65,0.8,0.9,"-"]
[null,"2 (Küste und Inseln der Ostsee)",0.85,1,1.1000000000000001,"-"]
[null,"3 (Binnenland)",0.8,0.95,1.1000000000000001,"-"]
[null,"3 (Küste und Inseln der Ostsee)",1.05,1.2,1.3,"-"]
[null,"4 (Binnenland)",0.95,1.1499999999999999,1.3,"-"]
[null,"4 (Küste und Inseln der Ostsee)",1.25,1.4,1.55,"-"]
[null,"4 (Inseln der Nordsee)",1.4,"-","-","-"]
[]
[null,{"$f":"IF(z_wind<=10,1,IF(z_wind<=18,2,IF(z_wind<=25,3,4)))","v":1}]
[]
[null,"S_A",{"$f":"S_AEingabe","v":250},"m"]
[null,null,"Data_SZD"]
[null,"lst_SZD"]
[null,"Zone 1",{"$f":"MAX(0.65,0.19+0.91*((S_A+140)/760)^2)","v":0.65}]
[null,"Zone 1a",{"$f":"MAX(0.81,1.25*(0.19+0.91*((S_A+140)/760)^2))","v":0.81}]
[null,"Zone 2",{"$f":"MAX(0.85,0.25+1.91*((S_A+140)/760)^2)","v":0.85}]
[null,"Zone 2a",{"$f":"MAX(1.06,1.25*(0.25+1.91*((S_A+140)/760)^2))","v":1.06}]
[null,"Zone 3",{"$f":"MAX(1.1,0.31+2.91*((S_A+140)/760)^2)","v":1.1000000000000001}]
[]
[null,{"$f":"MATCH(S_Zone,lst_SZD,0)","v":3},{"$f":"INDEX(Data_SZD,B124)","v":0.85}]

{"sheet":"Lastkombinationen","index":13,"n_rows":46,"n_cols":21,"rows_kept":46,"cut":false,"hidden":true,"merged":[[25,14,25,20]]}
[]
[null,null,null,null,null,null,null,null,null,null,"lt. EN 1991-1-1:2011 3.3.2(1) müssen auf Dächern Nutzlasten nicht in Kombination mit Schneelasten und/oder Windeinwirkungen angesetzt werden"]
[null,null,null,null,null,null,null,null,null,null,"lt EN 1991-1-1:2011 3.1.3(2) kmod mit kürzerster Lasteinwirkungsdauer"]
[]
[]
[null,"Lastkombination - Lasten parallel zur Dachfläche ",null,null,null,null,"Lasten parallel zum Bauteil lt. Ingenieurholzbau"]
[null,null,"g","n","s","w D","k mod","q d","q d / kmod",null,null,"Umrechnungsfaktor Lasten parallel zur Dachfläche"]
[{"$f":"MATCH(I12,I8:I11,0)","v":1},"g",1.35,null,null,null,0.6,{"$f":"(C8*(gk+vba_g2k+vba_g3k)*gk_pa)*b_e","v":0.31083749999999999},{"$f":"H8/G8","v":0.51806249999999998},null,null,"Eigengewicht","gk",{"$f":"SIN(beta*PI()/180)","v":1}]
[null,"g+n",1.35,1.5,null,null,0.9,{"$f":"(C9*(gk+vba_g2k+vba_g3k)*gk_pa+D9*nk*nk_pa)*b_e","v":0.31083750000000004},{"$f":"H9/G9","v":0.34537500000000004},null,null,"Schnee","sk",{"$f":"SIN(beta*PI()/180)*COS(beta*PI()/180)","v":6.1257422745431001E-17}]
[null,"g+s",1.35,null,1.5,null,{"$f":"IF(index_sHöhe=1,0.8,0.9)","v":0.9},{"$f":"(C10*(gk+vba_g2k+vba_g3k)*gk_pa+E10*sk*sk_pa)*b_e","v":0.31083750000000004},{"$f":"H10/G10","v":0.34537500000000004},null,null,"Nutzlast","nk",{"$f":"SIN(beta*PI()/180)*COS(beta*PI()/180)","v":6.1257422745431001E-17}]
[null,"g+s+(n)",1.35,{"$f":"1.5*0","v":0},1.5,null,0.9,{"$f":"(C11*(gk+vba_g2k+vba_g3k)*gk_pa+D11*nk*nk_pa+E11*sk*sk_pa)*b_e","v":0.31083750000000004},{"$f":"H11/G11","v":0.34537500000000004}]
[null,null,null,null,null,null,null,null,{"$f":"MAX(I8:I11)","v":0.51806249999999998},"KN/m"]
[]
[]
[null,"Lastkombination - Lasten normal zur Dachfläche (Winddruck)",null,null,null,null,"Lasten normal zum Bauteil lt. Ingenieurholzbau"]
[null,null,"g","n","s","w D","k mod","q d","q d / kmod",null,null,"Umrechnungsfaktor Lasten normal zur Dachfläche"]
[{"$f":"MATCH(I23,I17:I23,0)","v":5},"g",1.35,null,null,null,0.6,{"$f":"(C17*(gk+vba_g2k+vba_g3k)*gk_no)*b_e","v":1.9041104142632909E-17},{"$f":"H17/G17","v":3.1735173571054847E-17},null,null,"Eigengewicht","gk",{"$f":"COS(beta*PI()/180)","v":6.1257422745431001E-17}]
[null,"g+n",1.35,1.5,null,null,0.9,{"$f":"(C18*(gk+vba_g2k+vba_g3k)*gk_no+D18*nk*nk_no)*b_e","v":1.9041104142632912E-17},2.1156782380703235E-17,null,null,"Schnee","sk",{"$f":"COS(beta*PI()/180)*COS(beta*PI()/180)","v":3.7524718414124473E-33}]
[null,"g+s",1.35,null,1.5,null,{"$f":"IF(index_sHöhe=1,0.8,0.9)","v":0.9},{"$f":"(C19*(gk+vba_g2k+vba_g3k)*gk_no+E19*sk*sk_no)*b_e","v":1.9041104142632912E-17},2.1156782380703235E-17,null,null,"Nutzlast","nk",{"$f":"COS(beta*PI()/180)*COS(beta*PI()/180)","v":3.7524718414124473E-33}]
[null,"g+s+(wD)",1.35,null,1.5,{"$f":"1.5*0.6","v":0.89999999999999991},1,{"$f":"(C20*(gk+vba_g2k+vba_g3k)*gk_no+E20*sk*sk_no+F20*wdk)*b_e","v":0.53136116682757562},0.53136116682757562]
[null,"g+wD",1.35,null,null,1.5,1,{"$f":"(C21*(gk+vba_g2k+vba_g3k)*gk_no+F21*wdk)*b_e","v":0.8856019447126261},0.8856019447126261]
[null,"g+wD+(s)",1.35,null,{"$f":"1.5*IF(index_sHöhe=1,0.7,0.5)","v":0.75},1.5,1,{"$f":"(C22*(gk+vba_g2k+vba_g3k)*gk_no+E22*sk*sk_no+F22*wdk)*b_e","v":0.8856019447126261},0.8856019447126261]
[null,null,null,null,null,null,null,null,{"$f":"MAX(I17:I22)","v":0.8856019447126261},"KN/m"]
[]
[]
[null,"Lastkombination - Lasten normal zur Dachfläche (Windsog)",null,null,null,null,"Lasten parallel zum Bauteil lt. Ingenieurholzbau",null,null,null,null,null,null,null,"Schraubenabstand Windsog - Druckfeste Dämmung"]
[null,null,"g","n","s","w S","k mod","q d","q d / kmod"]
[{"$f":"MATCH(I29,I28:I28,0)","v":1},"g2+wS",0.9,null,null,1.5,1,{"$f":"($C$28*(vba_g2k+vba_g3k)*gk_no+$F$28*wsk)*b_e","v":-1.7712038894252522},{"$f":"H28/G28","v":-1.7712038894252522},null,null,"Eigengewicht ohne Dacheindeckung",null,null,null,null,"H,I","G",{"$f":"IF(index_Dachform=1,\"J\",\"F\")","v":"F"},{"$f":"IF(index_Dachform=1,\"F\",\"\")","v":""}]
[null,null,null,null,null,null,null,null,{"$f":"MAX(I28:I28)","v":-1.7712038894252522},"KN/m",null,null,null,null,"Windsog",null,{"$f":"($C$28*(vba_g2k+vba_g3k)*gk_no+$F$28*H_Sog)*b_e","v":-1.2076390155172172},{"$f":"($C$28*(vba_g2k+vba_g3k)*gk_no+$F$28*G_Sog)*b_e","v":-1.7712038894252522},{"$f":"($C$28*(vba_g2k+vba_g3k)*gk_no+$F$28*J_Sog)*b_e","v":-1.7712038894252522},{"$f":"($C$28*(vba_g2k+vba_g3k)*gk_no+$F$28*IF(index_Dachform=1,F_Sog,J_Sog))*b_e","v":-1.7712038894252522},"kN/m"]
[]
[null,null,null,null,null,null,null,null,{"$f":"COS(RADIANS(beta))","v":6.1257422745431001E-17},null,null,null,null,null,"Schraubenabstand",null,{"$f":"ROUNDDOWN(R_ax_sog/Q29*-1*100,1)","v":{"$error":"#NAME?"}},{"$f":"ROUNDDOWN(R_ax_sog/R29*-1*100,1)","v":{"$error":"#NAME?"}},{"$f":"ROUNDDOWN(R_ax_sog/S29*-1*100,1)","v":{"$error":"#NAME?"}},{"$f":"ROUNDDOWN(R_ax_sog/T29*-1*100,1)","v":{"$error":"#NAME?"}},"cm "]
[null,"Lastkombination - Lasten vertikal bezogen auf die schräge Länge"]
[null,null,"g","n","s","w D","k mod","q d","q d / kmod"]
[{"$f":"MATCH(I40,I34:I39,0)","v":1},"g",1.35,null,null,null,0.6,{"$f":"(C34*(gk+vba_g2k+vba_g3k)*b_e)","v":0.31083749999999999},{"$f":"H34/G34","v":0.51806249999999998}]
[null,"g+n",1.35,1.5,null,null,0.9,{"$f":"(C35*(gk+vba_g2k+vba_g3k)+(D35*nk*COS(RADIANS(beta))))*b_e","v":0.31083750000000004},0.34537500000000004,null,null,"s_schräge Länge","=","s * cos alpha"]
[null,"g+s",1.35,null,1.5,null,{"$f":"IF(index_sHöhe=1,0.8,0.9)","v":0.9},{"$f":"(C36*(gk+vba_g2k+vba_g3k)+(E36*sk)*COS(RADIANS(beta)))*b_e","v":0.31083750000000004},0.34537500000000004,null,null,"n_schräge Länge","=","n*cos alpha"]
[null,"g+s+(wD)",1.35,null,1.5,{"$f":"1.5*0.6","v":0.89999999999999991},1,{"$f":"((((C37*(gk+vba_g2k+vba_g3k)+(E37*sk)*COS(RADIANS(beta))))+IF(COS(RADIANS(beta))<10^-4,0,F37*wdk/COS(RADIANS(beta)))))*b_e","v":0.31083750000000004},0.31083750000000004,null,null,"w_schräge Länge","=","w/ cos alpha"]
[null,"g+wD",1.35,null,null,1.5,1,{"$f":"(C38*(gk+vba_g2k+vba_g3k)+IF(COS(RADIANS(beta))<10^-4,0,F37*wdk/COS(RADIANS(beta))))*b_e","v":0.31083749999999999},0.31083749999999999,null,null,"g_schräge Länge","=","g"]
[null,"g+wD+(s)",1.35,null,{"$f":"1.5*IF(index_sHöhe=1,0.7,0.5)","v":0.75},1.5,1,{"$f":"((C39*(gk+vba_g2k+vba_g3k)+(E39*sk)*COS(RADIANS(beta))+IF(COS(RADIANS(beta))<10^-4,0,F37*wdk/COS(RADIANS(beta)))))*b_e","v":0.31083750000000004},0.31083750000000004]
[null,null,null,null,null,null,null,null,{"$f":"MAX(I34:I39)","v":0.51806249999999998},"KN/m"]
[]
[]
[null,"Lastkombination - Lasten vertikal bezogen auf die schräge Länge (Windsog)"]
[null,null,"g","n","s","w S","k mod","q d","q d / kmod"]
[{"$f":"MATCH(I46,I45,0)","v":1},"g2+wS",0.9,null,null,1.5,1,{"$f":"(C45*(vba_g2k+vba_g3k)*COS(RADIANS(beta))+F45*wsk)*b_e","v":-1.7712038894252522},{"$f":"H45/G45","v":-1.7712038894252522}]
[null,null,null,null,null,null,null,null,{"$f":"I45","v":-1.7712038894252522},"KN/m"]

{"sheet":"Schrauben_ESSVE_25","index":14,"n_rows":316,"n_cols":45,"rows_kept":316,"cut":false,"hidden":true,"merged":[]}
["Typen"]
[]
[{"$f":"MATCH(vba_screwType,slst_screwtypes,0)","v":5},null,null,"sd",null,null,{"$f":"\"sdat_\"&index_variante&\"_\"&index_screwtype","v":"sdat_1_5"},null,"Stardrive"]
[{"$f":"MATCH(vba_screwType_2,slst_screwtypes,0)","v":1},null,null,"ra",null,null,null,null,"Rapid"]
["Typenliste",null,"slst_screwtypes_1","slst_screwtypes_1_keys",null,null,"slst_screwtypes_2","slst_screwtypes_2_keys",null,"Spalte AQ \"42\" =  Einteilung geeignet für Dämmung: hart=fest (H) bzw. weich (W) bzw. beide (H+W)",null,null,null,null,null,null,null,null,null,null,null,null,null,null,null,null,null,null,null,null,null,null,null,null,null,null,null,null,null,null,null,null,null,null,"Hilfsspalte - wieder löschen!"]
[null,1,"StarDrive GPR TG Senk",null,null,1,"Essve CY-FT (fullthread, cylinder head)","ad_type_C-FT",null,"statt 2x die gleichen Schrauben mit Aufteilung entspr. Spalte A",null,null,null,null,null,null,null,null,null,null,null,null,null,null,null,null,null,null,null,null,null,null,null,null,null,null,null,null,null,null,null,null,null,null,"neue Schrauben"]
[null,2,"StarDrive GPR TG TK",null,null,2,"Essve CY-FT (fullthread, cylinder head)","ad_type_CY-FT"]
[null,3,"Essve C-PT (partial thread, countersunk head)","ad_type_C-PT",null,3,"Essve CY-DT (double thread, cylinder head - thermal)","ad_type_CY-DT"]
[null,4,"Essve W-LF (partial thread, washer head)","ad_type_W-LF",null,null,"StarDrive VG - ersetzt durch Rapid"]
[null,5,"Essve C-FH (partial thread, washer countersunk)","ad_type_C-FH"]
[null,6,"Essve C-FT (fullthread, countersunk head)","ad_type_C-FT"]
[null,7,"Essve CY-FT (fullthread, cylinder head)","ad_type_CY-FT"]
[null,8,"Essve CY-DT (double thread, cylinder head - thermal)","ad_type_CY-DT"]
[]
[]
["Schraube"]
[null,{"$f":"vba_Screw","v":"ESSVE CY-FT  8,0 x 450/427"},null,null,null,null,null,null,null,null,null,null,"aktuell",null,null,null,null,null,null,null,null,null,null,null,null,null,null,null,null,null,null,null,null,null,null,null,null,null,null,null,"neu","neu","neu"]
[{"$f":"MATCH(vba_Screw,lst_Schrauben,0)","v":15},null,null,null,null,null,null,null,null,null,null,null,{"$f":"MIN(M22:M316)","v":10.7}]
[{"$f":"MATCH(vba_Screw_2,lst_Schrauben_2,0)","v":14},null,null,null,null,"nicht kontrolliert","nicht kontrolliert","nicht kontrolliert","aktuell","aktuell","aktuell","aktuell",{"$f":"MAX(M22:M316)","v":13.1},"aktuell","prüfen","prüfen","aktuell","aktuell","prüfen! wie bisher?","aktuell","aktuell","aktuell","aktuell","aktuell","aktuell","aktuell","aktuell","aktuell","aktuell","aktuell","aktuell","aktuell","ungültig","aktuell","aktuell","aktuell","aktuell","nicht kontrolliert","nicht kontrolliert","nicht kontrolliert","aktuell","aktuell","aktuell"]
[null,1,2,3,4,5,6,7,8,9,10,11,12,13,14,15,16,17,18,19,20,21,22,23,24,25,26,27,28,29,30,31,32,33,34,35,36,37,38,39,40,41,42]
[null,"TYP","Kopf","Gruppe","Artikelnr","ETA Code 1","ETA Code 2","ETA-\nKennbuchstabe","NAV-Bez1","NAV-Bez2","Zugtrag-\nfähigkeit [kN] (f-tens)","Fließ-\nmoment [Nm] (M y)","Auszieh-\nparameter [N/mm2]","Kopfdurchzieh-parameter [N/mm²] für 90 ° Sog Schrauben bei Scheibenkopf","für 45° od. 60° Verschraubung mit 60%","Kraft-vergleich [N] (f head)","Fließ-\ngrenze [N/mm2] (f y)","Torsions-\nfestigkeit [Nm] (f tor)\n(Bruchdrehmoment)","Einschraub\ndrehmoment [Nm]","Länge","DM","Dimension","Gewindelänge","Kopfdurch-messer","Kopf-Art [°]","Reibteil","Antrieb","Et Text 1 = Programm TEXT","Kopfgeo","Schaft","Gewinde","Oberfläche","Nummer Ü-Zeichen","ETA oder EN","ETA-Nummer","ETA-Jahreszahl","ETA-LE-Nummer","ETA-Überwachungsstelle","Etikettengröße","Programm","Gewindekern DM di","Schaftdurchmesser ds","Dämmung Hart/Weich (H/W/H+W)"]
["slst_1_1","Essve C-PT","countersunk","Essve part.thrd.","2339740601800001","060x180/064","A1B 0C1 A1C","C","Essve C-PT  6,0 x 180/70","HILO/KR/FRT/T30/YellWin500+ (SSH+Bit)",13.1,10.7,13,14.6,{"$f":"IF(C22=\"Scheibe\",N22*0.6,\"\")","v":""},{"$f":"X22*X22*N22","v":2102.4},900,10.9,5.4,180,6,"6,0 x 180",70,12,90,"+R","TX 30","RAPID®","Senkkopf, Frästaschen","Reibteil","HiLo-Teilgewinde, Kernrippen","YellWin 500+","Z-9.1-564, Z-9.1-509","ETA","ETA 12/0373",20,"LE003B","1359-CPD-0519","SSH_ETA.lab","C17",3.9,4.3,"H",3.9,{"$f":"AR22*1000","v":3900}]
[null,"Essve C-PT","countersunk","Essve part.thrd.","2339740602000001","060x200/064","A1B 0C1 A1C","C","Essve C-PT  6,0 x 200/70","HILO/KR/FRT/T30/YellWin500+ (SSH+Bit)",13.1,10.7,13,14.6,"",2102.4,900,10.9,5.4,200,6,"6,0 x 200",70,12,90,"+R","TX 30","RAPID®","Senkkopf, Frästaschen","Reibteil","HiLo-Teilgewinde, Kernrippen","YellWin 500+","Z-9.1-564, Z-9.1-509","ETA","ETA 12/0373",20,"LE003B","1359-CPD-0519","SSH_ETA.lab","C18",3.9,4.3,"H",3.9,3900]
[null,"Essve C-PT","countersunk","Essve part.thrd.","2339740602200001","060x220/064","A1B 0C1 A1C","C","Essve C-PT  6,0 x 220/70","HILO/KR/FRT/T30/YellWin500+ (SSH+Bit)",13.1,10.7,13,14.6,"",2102.4,900,10.9,5.4,220,6,"6,0 x 220",70,12,90,"+R","TX 30","RAPID®","Senkkopf, Frästaschen","Reibteil","HiLo-Teilgewinde, Kernrippen","YellWin 500+","Z-9.1-564, Z-9.1-509","ETA","ETA 12/0373",20,"LE003B","1359-CPD-0519","SSH_ETA.lab","C19",3.9,4.3,"H",3.9,3900]
[null,"Essve C-PT","countersunk","Essve part.thrd.","2339740602400001","060x240/064","A1B 0C1 A1C","C","Essve C-PT  6,0 x 240/70","HILO/KR/FRT/T30/YellWin500+ (SSH+Bit)",13.1,10.7,13,14.6,"",2102.4,900,10.9,5.4,240,6,"6,0 x 240",70,12,90,"+R","TX 30","RAPID®","Senkkopf, Frästaschen","Reibteil","HiLo-Teilgewinde, Kernrippen","YellWin 500+","Z-9.1-564, Z-9.1-509","ETA","ETA 12/0373",20,"LE003B","1359-CPD-0519","SSH_ETA.lab","C20",3.9,4.3,"H",3.9,3900]
[null,"Essve C-PT","countersunk","Essve part.thrd.","2339740602600001","060x260/064","A1B 0C1 A1C","C","Essve C-PT  6,0 x 260/70","HILO/KR/FRT/T30/YellWin500+ (SSH+Bit)",13.1,10.7,13,14.6,"",2102.4,900,10.9,5.4,260,6,"6,0 x 260",70,12,90,"+R","TX 30","RAPID®","Senkkopf, Frästaschen","Reibteil","HiLo-Teilgewinde, Kernrippen","YellWin 500+","Z-9.1-564, Z-9.1-509","ETA","ETA 12/0373",20,"LE003B","1359-CPD-0519","SSH_ETA.lab","C21",3.9,4.3,"H",3.9,3900]
[null,"Essve C-PT","countersunk","Essve part.thrd.","2339740602800001","060x280/064","A1B 0C1 A1C","C","Essve C-PT  6,0 x 280/70","HILO/KR/FRT/T30/YellWin500+ (SSH+Bit)",13.1,10.7,13,14.6,"",2102.4,900,10.9,5.4,280,6,"6,0 x 280",70,12,90,"+R","TX 30","RAPID®","Senkkopf, Frästaschen","Reibteil","HiLo-Teilgewinde, Kernrippen","YellWin 500+","Z-9.1-564, Z-9.1-509","ETA","ETA 12/0373",20,"LE003B","1359-CPD-0519","SSH_ETA.lab","C22",3.9,4.3,"H",3.9,3900]
[null,"Essve C-PT","countersunk","Essve part.thrd.","2339740603000001","060x300/064","A1B 0C1 A1C","C","Essve C-PT  6,0 x 300/70","HILO/KR/FRT/T30/YellWin500+ (SSH+Bit)",13.1,10.7,13,14.6,"",2102.4,900,10.9,5.4,300,6,"6,0 x 300",70,12,90,"+R","TX 30","RAPID®","Senkkopf, Frästaschen","Reibteil","HiLo-Teilgewinde, Kernrippen","YellWin 500+","Z-9.1-564, Z-9.1-509","ETA","ETA 12/0373",20,"LE003B","1359-CPD-0519","SSH_ETA.lab","C23",3.9,4.3,"H",3.9,3900]
[null,"Essve C-PT","countersunk","Essve part.thrd.","2339740801800001","080x180/100","A1B 1D0 A1C","C","Essve C-PT  8,0 x 180/100","HILO/KR/FRT/T40/YellWin500+ (SSH+Bit)",23.3,22.6,10.9,12.4,"",2790,900,28,11.2,180,8,"8,0 x 180",100,15,90,"+R","TX 40","RAPID®","Senkkopf, Frästaschen","Reibteil","HiLo-Teilgewinde, Kernrippen","YellWin 500+","Z-9.1-564, Z-9.1-509","ETA","ETA 12/0373",20,"LE003B","1359-CPD-0519","SSH_ETA.lab","C24",5.3,5.9,"H",5.3,5300]
[null,"Essve C-PT","countersunk","Essve part.thrd.","2339740802000001","080x200/100","A1B 1D0 A1C","C","Essve C-PT  8,0 x 200/100","HILO/KR/FRT/T40/YellWin500+ (SSH+Bit)",23.3,22.6,10.9,12.4,"",2790,900,28,11.2,200,8,"8,0 x 200",100,15,90,"+R","TX 40","RAPID®","Senkkopf, Frästaschen","Reibteil","HiLo-Teilgewinde, Kernrippen","YellWin 500+","Z-9.1-564, Z-9.1-509","ETA","ETA 12/0373",20,"LE003B","1359-CPD-0519","SSH_ETA.lab","C25",5.3,5.9,"H",5.3,5300]
[null,"Essve C-PT","countersunk","Essve part.thrd.","2339740802200001","080x220/100","A1B 1D0 A1C","C","Essve C-PT  8,0 x 220/100","HILO/KR/FRT/T40/YellWin500+ (SSH+Bit)",23.3,22.6,10.9,12.4,"",2790,900,28,11.2,220,8,"8,0 x 220",100,15,90,"+R","TX 40","RAPID®","Senkkopf, Frästaschen","Reibteil","HiLo-Teilgewinde, Kernrippen","YellWin 500+","Z-9.1-564, Z-9.1-509","ETA","ETA 12/0373",20,"LE003B","1359-CPD-0519","SSH_ETA.lab","C26",5.3,5.9,"H",5.3,5300]
[null,"Essve C-PT","countersunk","Essve part.thrd.","2339740802400001","080x240/100","A1B 1D0 A1C","C","Essve C-PT  8,0 x 240/100","HILO/KR/FRT/T40/YellWin500+ (SSH+Bit)",23.3,22.6,10.9,12.4,"",2790,900,28,11.2,240,8,"8,0 x 240",100,15,90,"+R","TX 40","RAPID®","Senkkopf, Frästaschen","Reibteil","HiLo-Teilgewinde, Kernrippen","YellWin 500+","Z-9.1-564, Z-9.1-509","ETA","ETA 12/0373",20,"LE003B","1359-CPD-0519","SSH_ETA.lab","C27",5.3,5.9,"H",5.3,5300]
[null,"Essve C-PT","countersunk","Essve part.thrd.","2339740802600001","080x260/100","A1B 1D0 A1C","C","Essve C-PT  8,0 x 260/100","HILO/KR/FRT/T40/YellWin500+ (SSH+Bit)",23.3,22.6,10.9,12.4,"",2790,900,28,11.2,260,8,"8,0 x 260",100,15,90,"+R","TX 40","RAPID®","Senkkopf, Frästaschen","Reibteil","HiLo-Teilgewinde, Kernrippen","YellWin 500+","Z-9.1-564, Z-9.1-509","ETA","ETA 12/0373",20,"LE003B","1359-CPD-0519","SSH_ETA.lab","C28",5.3,5.9,"H",5.3,5300]
[null,"Essve C-PT","countersunk","Essve part.thrd.","2339740802800001","080x280/100","A1B 1D0 A1C","C","Essve C-PT  8,0 x 280/100","HILO/KR/FRT/T40/YellWin500+ (SSH+Bit)",23.3,22.6,10.9,12.4,"",2790,900,28,11.2,280,8,"8,0 x 280",100,15,90,"+R","TX 40","RAPID®","Senkkopf, Frästaschen","Reibteil","HiLo-Teilgewinde, Kernrippen","YellWin 500+","Z-9.1-564, Z-9.1-509","ETA","ETA 12/0373",20,"LE003B","1359-CPD-0519","SSH_ETA.lab","C29",5.3,5.9,"H",5.3,5300]
[null,"Essve C-PT","countersunk","Essve part.thrd.","2339740803000001","080x300/100","A1B 1D0 A1C","C","Essve C-PT  8,0 x 300/100","HILO/KR/FRT/T40/YellWin500+ (SSH+Bit)",23.3,22.6,10.9,12.4,"",2790,900,28,11.2,300,8,"8,0 x 300",100,15,90,"+R","TX 40","RAPID®","Senkkopf, Frästaschen","Reibteil","HiLo-Teilgewinde, Kernrippen","YellWin 500+","Z-9.1-564, Z-9.1-509","ETA","ETA 12/0373",20,"LE003B","1359-CPD-0519","SSH_ETA.lab","C30",5.3,5.9,"H",5.3,5300]
[null,"Essve C-PT","countersunk","Essve part.thrd.","2339740803200001","080x320/100","A1B 1D0 A1C","C","Essve C-PT  8,0 x 320/100","HILO/KR/FRT/T40/YellWin500+ (SSH+Bit)",23.3,22.6,10.9,12.4,"",2790,900,28,11.2,320,8,"8,0 x 320",100,15,90,"+R","TX 40","RAPID®","Senkkopf, Frästaschen","Reibteil","HiLo-Teilgewinde, Kernrippen","YellWin 500+","Z-9.1-564, Z-9.1-509","ETA","ETA 12/0373",20,"LE003B","1359-CPD-0519","SSH_ETA.lab","C31",5.3,5.9,"H",5.3,5300]
[null,"Essve C-PT","countersunk","Essve part.thrd.","2339740803400001","080x340/100","A1B 1D0 A1C","C","Essve C-PT  8,0 x 340/100","HILO/KR/FRT/T40/YellWin500+ (SSH+Bit)",23.3,22.6,10.9,12.4,"",2790,900,28,11.2,340,8,"8,0 x 340",100,15,90,"+R","TX 40","RAPID®","Senkkopf, Frästaschen","Reibteil","HiLo-Teilgewinde, Kernrippen","YellWin 500+","Z-9.1-564, Z-9.1-509","ETA","ETA 12/0373",20,"LE003B","1359-CPD-0519","SSH_ETA.lab","C32",5.3,5.9,"H",5.3,5300]
[null,"Essve C-PT","countersunk","Essve part.thrd.","2339740803600001","080x360/100","A1B 1D0 A1C","C","Essve C-PT  8,0 x 360/100","HILO/KR/FRT/T40/YellWin500+ (SSH+Bit)",23.3,22.6,10.9,12.4,"",2790,900,28,11.2,360,8,"8,0 x 360",100,15,90,"+R","TX 40","RAPID®","Senkkopf, Frästaschen","Reibteil","HiLo-Teilgewinde, Kernrippen","YellWin 500+","Z-9.1-564, Z-9.1-509","ETA","ETA 12/0373",20,"LE003B","1359-CPD-0519","SSH_ETA.lab","C33",5.3,5.9,"H",5.3,5300]
[null,"Essve C-PT","countersunk","Essve part.thrd.","2339740803800001","080x380/100","A1B 1D0 A1C","C","Essve C-PT  8,0 x 380/100","HILO/KR/FRT/T40/YellWin500+ (SSH+Bit)",23.3,22.6,10.9,12.4,"",2790,900,28,11.2,380,8,"8,0 x 380",100,15,90,"+R","TX 40","RAPID®","Senkkopf, Frästaschen","Reibteil","HiLo-Teilgewinde, Kernrippen","YellWin 500+","Z-9.1-564, Z-9.1-509","ETA","ETA 12/0373",20,"LE003B","1359-CPD-0519","SSH_ETA.lab","C34",5.3,5.9,"H",5.3,5300]
[null,"Essve C-PT","countersunk","Essve part.thrd.","2339740804000001","080x400/100","A1B 1D0 A1C","C","Essve C-PT  8,0 x 400/100","HILO/KR/FRT/T40/YellWin500+ (SSH+Bit)",23.3,22.6,10.9,12.4,"",2790,900,28,11.2,400,8,"8,0 x 400",100,15,90,"+R","TX 40","RAPID®","Senkkopf, Frästaschen","Reibteil","HiLo-Teilgewinde, Kernrippen","YellWin 500+","Z-9.1-564, Z-9.1-509","ETA","ETA 12/0373",20,"LE003B","1359-CPD-0519","SSH_ETA.lab","C35",5.3,5.9,"H",5.3,5300]
[null,"Essve C-PT","countersunk","Essve part.thrd.","2339740804200001","080x420/100","A1B 1D0 A1C","C","Essve C-PT  8,0 x 420/100","HILO/KR/FRT/T40/YellWin500+ (SSH+Bit)",23.3,22.6,10.9,12.4,"",2790,900,28,11.2,420,8,"8,0 x 420",100,15,90,"+R","TX 40","RAPID®","Senkkopf, Frästaschen","Reibteil","HiLo-Teilgewinde, Kernrippen","YellWin 500+","Z-9.1-564, Z-9.1-509","ETA","ETA 12/0373",20,"LE003B","1359-CPD-0519","SSH_ETA.lab","C36",5.3,5.9,"H",5.3,5300]
[null,"Essve C-PT","countersunk","Essve part.thrd.","2339740804400001","080x440/100","A1B 1D0 A1C","C","Essve C-PT  8,0 x 440/100","HILO/KR/FRT/T40/YellWin500+ (SSH+Bit)",23.3,22.6,10.9,12.4,"",2790,900,28,11.2,440,8,"8,0 x 440",100,15,90,"+R","TX 40","RAPID®","Senkkopf, Frästaschen","Reibteil","HiLo-Teilgewinde, Kernrippen","YellWin 500+","Z-9.1-564, Z-9.1-509","ETA","ETA 12/0373",20,"LE003B","1359-CPD-0519","SSH_ETA.lab","C37",5.3,5.9,"H",5.3,5300]
[null,"Essve C-PT","countersunk","Essve part.thrd.","2339740804600001","080x460/100","A1B 1D0 A1C","C","Essve C-PT  8,0 x 460/100","HILO/KR/FRT/T40/YellWin500+ (SSH+Bit)",23.3,22.6,10.9,12.4,"",2790,900,28,11.2,460,8,"8,0 x 460",100,15,90,"+R","TX 40","RAPID®","Senkkopf, Frästaschen","Reibteil","HiLo-Teilgewinde, Kernrippen","YellWin 500+","Z-9.1-564, Z-9.1-509","ETA","ETA 12/0373",20,"LE003B","1359-CPD-0519","SSH_ETA.lab","C38",5.3,5.9,"H",5.3,5300]
[null,"Essve C-PT","countersunk","Essve part.thrd.","2339740804800001","080x480/100","A1B 1D0 A1C","C","Essve C-PT  8,0 x 480/100","HILO/KR/FRT/T40/YellWin500+ (SSH+Bit)",23.3,22.6,10.9,12.4,"",2790,900,28,11.2,480,8,"8,0 x 480",100,15,90,"+R","TX 40","RAPID®","Senkkopf, Frästaschen","Reibteil","HiLo-Teilgewinde, Kernrippen","YellWin 500+","Z-9.1-564, Z-9.1-509","ETA","ETA 12/0373",20,"LE003B","1359-CPD-0519","SSH_ETA.lab","C39",5.3,5.9,"H",5.3,5300]
[null,"Essve C-PT","countersunk","Essve part.thrd.","2339740805000001","080x500/100","A1B 1D0 A1C","C","Essve C-PT  8,0 x 500/100","HILO/KR/FRT/T40/YellWin500+ (SSH+Bit)",23.3,22.6,10.9,12.4,"",2790,900,28,11.2,500,8,"8,0 x 500",100,15,90,"+R","TX 40","RAPID®","Senkkopf, Frästaschen","Reibteil","HiLo-Teilgewinde, Kernrippen","YellWin 500+","Z-9.1-564, Z-9.1-509","ETA","ETA 12/0373",20,"LE003B","1359-CPD-0519","SSH_ETA.lab","C40",5.3,5.9,"H",5.3,5300]
[null,"Essve C-PT","countersunk","Essve part.thrd.","2339741001800001","100x180/100","A1B 1D0 A1C","C","Essve C-PT  10,0 x 180/100","HILO/KR/UKR/T50/YellWin500+ (SSH+Bit)",35,33.6,11,12.2,"",4175.45,900,52.5,17,180,10,"10,0 x 180",100,18.5,90,"+R","TX 50","RAPID®","Senkkopf, Frästaschen","Reibteil","HiLo-Teilgewinde, Kernrippen","YellWin 500+","Z-9.1-564, Z-9.1-509","ETA","ETA 12/0373",20,"LE003B","1359-CPD-0519","SSH_ETA.lab","C41",6.7,7.1,"H",6.7,6700]
[null,"Essve C-PT","countersunk","Essve part.thrd.","2339741002000001","100x200/100","A1B 1D0 A1C","C","Essve C-PT  10,0 x 200/100","HILO/KR/UKR/T50/YellWin500+ (SSH+Bit)",35,33.6,11,12.2,"",4175.45,900,52.5,17,200,10,"10,0 x 200",100,18.5,90,"+R","TX 50","RAPID®","Senkkopf, Frästaschen","Reibteil","HiLo-Teilgewinde, Kernrippen","YellWin 500+","Z-9.1-564, Z-9.1-509","ETA","ETA 12/0373",20,"LE003B","1359-CPD-0519","SSH_ETA.lab","C42",6.7,7.1,"H",6.7,6700]
[null,"Essve C-PT","countersunk","Essve part.thrd.","2339741002200001","100x220/100","A1B 1D0 A1C","C","Essve C-PT  10,0 x 220/100","HILO/KR/UKR/T50/YellWin500+ (SSH+Bit)",35,33.6,11,12.2,"",4175.45,900,52.5,17,220,10,"10,0 x 220",100,18.5,90,"+R","TX 50","RAPID®","Senkkopf, Frästaschen","Reibteil","HiLo-Teilgewinde, Kernrippen","YellWin 500+","Z-9.1-564, Z-9.1-509","ETA","ETA 12/0373",20,"LE003B","1359-CPD-0519","SSH_ETA.lab","C43",6.7,7.1,"H",6.7,6700]
[null,"Essve C-PT","countersunk","Essve part.thrd.","2339741002400001","100x240/100","A1B 1D0 A1C","C","Essve C-PT  10,0 x 240/100","HILO/KR/UKR/T50/YellWin500+ (SSH+Bit)",35,33.6,11,12.2,"",4175.45,900,52.5,17,240,10,"10,0 x 240",100,18.5,90,"+R","TX 50","RAPID®","Senkkopf, Frästaschen","Reibteil","HiLo-Teilgewinde, Kernrippen","YellWin 500+","Z-9.1-564, Z-9.1-509","ETA","ETA 12/0373",20,"LE003B","1359-CPD-0519","SSH_ETA.lab","C44",6.7,7.1,"H",6.7,6700]
[null,"Essve C-PT","countersunk","Essve part.thrd.","2339741002600001","100x260/100","A1B 1D0 A1C","C","Essve C-PT  10,0 x 260/100","HILO/KR/UKR/T50/YellWin500+ (SSH+Bit)",35,33.6,11,12.2,"",4175.45,900,52.5,17,260,10,"10,0 x 260",100,18.5,90,"+R","TX 50","RAPID®","Senkkopf, Frästaschen","Reibteil","HiLo-Teilgewinde, Kernrippen","YellWin 500+","Z-9.1-564, Z-9.1-509","ETA","ETA 12/0373",20,"LE003B","1359-CPD-0519","SSH_ETA.lab","C45",6.7,7.1,"H",6.7,6700]
[null,"Essve C-PT","countersunk","Essve part.thrd.","2339741002800001","100x280/100","A1B 1D0 A1C","C","Essve C-PT  10,0 x 280/100","HILO/KR/UKR/T50/YellWin500+ (SSH+Bit)",35,33.6,11,12.2,"",4175.45,900,52.5,17,280,10,"10,0 x 280",100,18.5,90,"+R","TX 50","RAPID®","Senkkopf, Frästaschen","Reibteil","HiLo-Teilgewinde, Kernrippen","YellWin 500+","Z-9.1-564, Z-9.1-509","ETA","ETA 12/0373",20,"LE003B","1359-CPD-0519","SSH_ETA.lab","C46",6.7,7.1,"H",6.7,6700]
[null,"Essve C-PT","countersunk","Essve part.thrd.","2339741003000001","100x300/100","A1B 1D0 A1C","C","Essve C-PT  10,0 x 300/100","HILO/KR/UKR/T50/YellWin500+ (SSH+Bit)",35,33.6,11,12.2,"",4175.45,900,52.5,17,300,10,"10,0 x 300",100,18.5,90,"+R","TX 50","RAPID®","Senkkopf, Frästaschen","Reibteil","HiLo-Teilgewinde, Kernrippen","YellWin 500+","Z-9.1-564, Z-9.1-509","ETA","ETA 12/0373",20,"LE003B","1359-CPD-0519","SSH_ETA.lab","C47",6.7,7.1,"H",6.7,6700]
[null,"Essve C-PT","countersunk","Essve part.thrd.","2339741003200001","100x320/120","A1B 1D0 A1C","C","Essve C-PT  10,0 x 320/100","HILO/KR/UKR/T50/YellWin500+ (SSH+Bit)",35,33.6,11,12.2,"",4175.45,900,52.5,17,320,10,"10,0 x 320",100,18.5,90,"+R","TX 50","RAPID®","Senkkopf, Frästaschen","Reibteil","HiLo-Teilgewinde, Kernrippen","YellWin 500+","Z-9.1-564, Z-9.1-509","ETA","ETA 12/0373",20,"LE003B","1359-CPD-0519","SSH_ETA.lab","C48",6.7,7.1,"H",6.7,6700]
[null,"Essve C-PT","countersunk","Essve part.thrd.","2339741003400001","100x340/120","A1B 1D0 A1C","C","Essve C-PT  10,0 x 340/100","HILO/KR/UKR/T50/YellWin500+ (SSH+Bit)",35,33.6,11,12.2,"",4175.45,900,52.5,17,340,10,"10,0 x 340",100,18.5,90,"+R","TX 50","RAPID®","Senkkopf, Frästaschen","Reibteil","HiLo-Teilgewinde, Kernrippen","YellWin 500+","Z-9.1-564, Z-9.1-509","ETA","ETA 12/0373",20,"LE003B","1359-CPD-0519","SSH_ETA.lab","C49",6.7,7.1,"H",6.7,6700]
[null,"Essve C-PT","countersunk","Essve part.thrd.","2339741003600001","100x360/120","A1B 1D0 A1C","C","Essve C-PT  10,0 x 360/100","HILO/KR/UKR/T50/YellWin500+ (SSH+Bit)",35,33.6,11,12.2,"",4175.45,900,52.5,17,360,10,"10,0 x 360",100,18.5,90,"+R","TX 50","RAPID®","Senkkopf, Frästaschen","Reibteil","HiLo-Teilgewinde, Kernrippen","YellWin 500+","Z-9.1-564, Z-9.1-509","ETA","ETA 12/0373",20,"LE003B","1359-CPD-0519","SSH_ETA.lab","C50",6.7,7.1,"H",6.7,6700]
[null,"Essve C-PT","countersunk","Essve part.thrd.","2339741003800001","100x380/120","A1B 1D0 A1C","C","Essve C-PT  10,0 x 380/100","HILO/KR/UKR/T50/YellWin500+ (SSH+Bit)",35,33.6,11,12.2,"",4175.45,900,52.5,17,380,10,"10,0 x 380",100,18.5,90,"+R","TX 50","RAPID®","Senkkopf, Frästaschen","Reibteil","HiLo-Teilgewinde, Kernrippen","YellWin 500+","Z-9.1-564, Z-9.1-509","ETA","ETA 12/0373",20,"LE003B","1359-CPD-0519","SSH_ETA.lab","C51",6.7,7.1,"H",6.7,6700]
[null,"Essve C-PT","countersunk","Essve part.thrd.","2339741004000001","100x400/120","A1B 1D0 A1C","C","Essve C-PT  10,0 x 400/100","HILO/KR/UKR/T50/YellWin500+ (SSH+Bit)",35,33.6,11,12.2,"",4175.45,900,52.5,17,400,10,"10,0 x 400",100,18.5,90,"+R","TX 50","RAPID®","Senkkopf, Frästaschen","Reibteil","HiLo-Teilgewinde, Kernrippen","YellWin 500+","Z-9.1-564, Z-9.1-509","ETA","ETA 12/0373",20,"LE003B","1359-CPD-0519","SSH_ETA.lab","C52",6.7,7.1,"H",6.7,6700]
[null,"Essve C-PT","countersunk","Essve part.thrd.","2339741004200001","100x420/120","A1B 1D0 A1C","C","Essve C-PT  10,0 x 420/100","HILO/KR/UKR/T50/YellWin500+ (SSH+Bit)",35,33.6,11,12.2,"",4175.45,900,52.5,17,420,10,"10,0 x 420",100,18.5,90,"+R","TX 50","RAPID®","Senkkopf, Frästaschen","Reibteil","HiLo-Teilgewinde, Kernrippen","YellWin 500+","Z-9.1-564, Z-9.1-509","ETA","ETA 12/0373",20,"LE003B","1359-CPD-0519","SSH_ETA.lab","C53",6.7,7.1,"H",6.7,6700]
[null,"Essve C-PT","countersunk","Essve part.thrd.","2339741004400001","100x440/120","A1B 1D0 A1C","C","Essve C-PT  10,0 x 440/100","HILO/KR/UKR/T50/YellWin500+ (SSH+Bit)",35,33.6,11,12.2,"",4175.45,900,52.5,17,440,10,"10,0 x 440",100,18.5,90,"+R","TX 50","RAPID®","Senkkopf, Frästaschen","Reibteil","HiLo-Teilgewinde, Kernrippen","YellWin 500+","Z-9.1-564, Z-9.1-509","ETA","ETA 12/0373",20,"LE003B","1359-CPD-0519","SSH_ETA.lab","C54",6.7,7.1,"H",6.7,6700]
[null,"Essve C-PT","countersunk","Essve part.thrd.","2339741004600001","100x460/120","A1B 1D0 A1C","C","Essve C-PT  10,0 x 460/100","HILO/KR/UKR/T50/YellWin500+ (SSH+Bit)",35,33.6,11,12.2,"",4175.45,900,52.5,17,460,10,"10,0 x 460",100,18.5,90,"+R","TX 50","RAPID®","Senkkopf, Frästaschen","Reibteil","HiLo-Teilgewinde, Kernrippen","YellWin 500+","Z-9.1-564, Z-9.1-509","ETA","ETA 12/0373",20,"LE003B","1359-CPD-0519","SSH_ETA.lab","C55",6.7,7.1,"H",6.7,6700]
[null,"Essve C-PT","countersunk","Essve part.thrd.","2339741004800001","100x480/120","A1B 1D0 A1C","C","Essve C-PT  10,0 x 480/100","HILO/KR/UKR/T50/YellWin500+ (SSH+Bit)",35,33.6,11,12.2,"",4175.45,900,52.5,17,480,10,"10,0 x 480",100,18.5,90,"+R","TX 50","RAPID®","Senkkopf, Frästaschen","Reibteil","HiLo-Teilgewinde, Kernrippen","YellWin 500+","Z-9.1-564, Z-9.1-509","ETA","ETA 12/0373",20,"LE003B","1359-CPD-0519","SSH_ETA.lab","C56",6.7,7.1,"H",6.7,6700]
[null,"Essve C-PT","countersunk","Essve part.thrd.","2339741005000001","100x500/120","A1B 1D0 A1C","C","Essve C-PT  10,0 x 500/100","HILO/KR/UKR/T50/YellWin500+ (SSH+Bit)",35,33.6,11,12.2,"",4175.45,900,52.5,17,500,10,"10,0 x 500",100,18.5,90,"+R","TX 50","RAPID®","Senkkopf, Frästaschen","Reibteil","HiLo-Teilgewinde, Kernrippen","YellWin 500+","Z-9.1-564, Z-9.1-509","ETA","ETA 12/0373",20,"LE003B","1359-CPD-0519","SSH_ETA.lab","C57",6.7,7.1,"H",6.7,6700]
[null,"Essve C-PT","countersunk","Essve part.thrd.","1339741201800001",null,null,null,"Essve C-PT  12,0 x 180/100","EG/KR/UKR/T50/YellWin500+ (SSH+Bit)",42,46.9,11.2,11,"",4400,900,59.6,27.6,180,12,"12,0 x 180",100,20,90,"+R","TX 50","RAPID®","Senkkopf, Frästaschen","Reibteil","EG-Teilgewinde, Kernrippen","YellWin 500+",null,"ETA","ETA 12/0373",20,"LE003B","1359-CPD-0519",null,null,7,8.1999999999999993,"H",7,7000]
[null,"Essve C-PT","countersunk","Essve part.thrd.","1339741202000001",null,null,null,"Essve C-PT  12,0 x 200/100","EG/KR/UKR/T50/YellWin500+ (SSH+Bit)",42,46.9,11.2,11,"",4400,900,59.6,27.6,200,12,"12,0 x 200",100,20,90,"+R","TX 50","RAPID®","Senkkopf, Frästaschen","Reibteil","EG-Teilgewinde, Kernrippen","YellWin 500+",null,"ETA","ETA 12/0373",20,"LE003B","1359-CPD-0519",null,null,7,8.1999999999999993,"H",7,7000]
[null,"Essve C-PT","countersunk","Essve part.thrd.","1339741202200001",null,null,null,"Essve C-PT  12,0 x 220/100","EG/KR/UKR/T50/YellWin500+ (SSH+Bit)",42,46.9,11.2,11,"",4400,900,59.6,27.6,220,12,"12,0 x 220",100,20,90,"+R","TX 50","RAPID®","Senkkopf, Frästaschen","Reibteil","EG-Teilgewinde, Kernrippen","YellWin 500+",null,"ETA","ETA 12/0373",20,"LE003B","1359-CPD-0519",null,null,7,8.1999999999999993,"H",7,7000]
[null,"Essve C-PT","countersunk","Essve part.thrd.","1339741202400001",null,null,null,"Essve C-PT  12,0 x 240/100","EG/KR/UKR/T50/YellWin500+ (SSH+Bit)",42,46.9,11.2,11,"",4400,900,59.6,27.6,240,12,"12,0 x 240",100,20,90,"+R","TX 50","RAPID®","Senkkopf, Frästaschen","Reibteil","EG-Teilgewinde, Kernrippen","YellWin 500+",null,"ETA","ETA 12/0373",20,"LE003B","1359-CPD-0519",null,null,7,8.1999999999999993,"H",7,7000]
[null,"Essve C-PT","countersunk","Essve part.thrd.","1339741202600001",null,null,null,"Essve C-PT  12,0 x 260/100","EG/KR/UKR/T50/YellWin500+ (SSH+Bit)",42,46.9,11.2,11,"",4400,900,59.6,27.6,260,12,"12,0 x 260",100,20,90,"+R","TX 50","RAPID®","Senkkopf, Frästaschen","Reibteil","EG-Teilgewinde, Kernrippen","YellWin 500+",null,"ETA","ETA 12/0373",20,"LE003B","1359-CPD-0519",null,null,7,8.1999999999999993,"H",7,7000]
[null,"Essve C-PT","countersunk","Essve part.thrd.","1339741202800001",null,null,null,"Essve C-PT  12,0 x 280/100","EG/KR/UKR/T50/YellWin500+ (SSH+Bit)",42,46.9,11.2,11,"",4400,900,59.6,27.6,280,12,"12,0 x 280",100,20,90,"+R","TX 50","RAPID®","Senkkopf, Frästaschen","Reibteil","EG-Teilgewinde, Kernrippen","YellWin 500+",null,"ETA","ETA 12/0373",20,"LE003B","1359-CPD-0519",null,null,7,8.1999999999999993,"H",7,7000]
[null,"Essve C-PT","countersunk","Essve part.thrd.","1339741203000001",null,null,null,"Essve C-PT  12,0 x 300/120","EG/KR/UKR/T50/YellWin500+ (SSH+Bit)",42,46.9,11.2,11,"",4400,900,59.6,27.6,300,12,"12,0 x 300",120,20,90,"+R","TX 50","RAPID®","Senkkopf, Frästaschen","Reibteil","EG-Teilgewinde, Kernrippen","YellWin 500+",null,"ETA","ETA 12/0373",20,"LE003B","1359-CPD-0519",null,null,7,8.1999999999999993,"H",7,7000]
[null,"Essve C-PT","countersunk","Essve part.thrd.","1339741203200001",null,null,null,"Essve C-PT  12,0 x 320/120","EG/KR/UKR/T50/YellWin500+ (SSH+Bit)",42,46.9,11.2,11,"",4400,900,59.6,27.6,320,12,"12,0 x 320",120,20,90,"+R","TX 50","RAPID®","Senkkopf, Frästaschen","Reibteil","EG-Teilgewinde, Kernrippen","YellWin 500+",null,"ETA","ETA 12/0373",20,"LE003B","1359-CPD-0519",null,null,7,8.1999999999999993,"H",7,7000]
[null,"Essve C-PT","countersunk","Essve part.thrd.","1339741203400001",null,null,null,"Essve C-PT  12,0 x 340/120","EG/KR/UKR/T50/YellWin500+ (SSH+Bit)",42,46.9,11.2,11,"",4400,900,59.6,27.6,340,12,"12,0 x 340",120,20,90,"+R","TX 50","RAPID®","Senkkopf, Frästaschen","Reibteil","EG-Teilgewinde, Kernrippen","YellWin 500+",null,"ETA","ETA 12/0373",20,"LE003B","1359-CPD-0519",null,null,7,8.1999999999999993,"H",7,7000]
[null,"Essve C-PT","countersunk","Essve part.thrd.","1339741203600001",null,null,null,"Essve C-PT  12,0 x 360/120","EG/KR/UKR/T50/YellWin500+ (SSH+Bit)",42,46.9,11.2,11,"",4400,900,59.6,27.6,360,12,"12,0 x 360",120,20,90,"+R","TX 50","RAPID®","Senkkopf, Frästaschen","Reibteil","EG-Teilgewinde, Kernrippen","YellWin 500+",null,"ETA","ETA 12/0373",20,"LE003B","1359-CPD-0519",null,null,7,8.1999999999999993,"H",7,7000]
[null,"Essve C-PT","countersunk","Essve part.thrd.","1339741203800001",null,null,null,"Essve C-PT  12,0 x 380/120","EG/KR/UKR/T50/YellWin500+ (SSH+Bit)",42,46.9,11.2,11,"",4400,900,59.6,27.6,380,12,"12,0 x 380",120,20,90,"+R","TX 50","RAPID®","Senkkopf, Frästaschen","Reibteil","EG-Teilgewinde, Kernrippen","YellWin 500+",null,"ETA","ETA 12/0373",20,"LE003B","1359-CPD-0519",null,null,7,8.1999999999999993,"H",7,7000]
[null,"Essve C-PT","countersunk","Essve part.thrd.","1339741204000001",null,null,null,"Essve C-PT  12,0 x 400/120","EG/KR/UKR/T50/YellWin500+ (SSH+Bit)",42,46.9,11.2,11,"",4400,900,59.6,27.6,400,12,"12,0 x 400",120,20,90,"+R","TX 50","RAPID®","Senkkopf, Frästaschen","Reibteil","EG-Teilgewinde, Kernrippen","YellWin 500+",null,"ETA","ETA 12/0373",20,"LE003B","1359-CPD-0519",null,null,7,8.1999999999999993,"H",7,7000]
["slst_1_2","Essve WH","Disc","Essve part.thrd. washer","2333740601800001",null,null,null,"Essve WH S-14, 6,0 x 180/70","HILO/KR/T30/YellWin500+ (SSH+Bit)",13.1,10.7,13,16.7,"",3273.2,900,10.9,5.4,180,6,"6,0 x 180",70,14,180,"+R","TX 30","RAPID® S-14","Scheibenkopf","Reibteil","HiLo-Teilgewinde, Kernrippen","YellWin 500+",null,"ETA","ETA 12/0373",20,"LE003B","1359-CPD-0519",null,null,3.9,4.3,"H",3.9,3900]
[null,"Essve WH","Disc","Essve part.thrd. washer","2333740602000001",null,null,null,"Essve WH S-14, 6,0 x 200/70","HILO/KR/T30/YellWin500+ (SSH+Bit)",13.1,10.7,13,16.7,"",3273.2,900,10.9,5.4,200,6,"6,0 x 200",70,14,180,"+R","TX 30","RAPID® S-14","Scheibenkopf","Reibteil","HiLo-Teilgewinde, Kernrippen","YellWin 500+",null,"ETA","ETA 12/0373",20,"LE003B","1359-CPD-0519",null,null,3.9,4.3,"H",3.9,3900]
[null,"Essve WH","Disc","Essve part.thrd. washer","2333740602200001",null,null,null,"Essve WH S-14, 6,0 x 220/70","HILO/KR/T30/YellWin500+ (SSH+Bit)",13.1,10.7,13,16.7,{"$f":"IF(C77=\"Scheibe\",N77*0.6,\"\")","v":""},{"$f":"X77*X77*N77","v":3273.2},900,10.9,5.4,220,6,"6,0 x 220",70,14,180,"+R","TX 30","RAPID® S-14","Scheibenkopf","Reibteil","HiLo-Teilgewinde, Kernrippen","YellWin 500+",null,"ETA","ETA 12/0373",20,"LE003B","1359-CPD-0519",null,null,3.9,4.3,"H",3.9,{"$f":"AR77*1000","v":3900}]
[null,"Essve WH","Disc","Essve part.thrd. washer","2333740602400001",null,null,null,"Essve WH S-14, 6,0 x 240/70","HILO/KR/T30/YellWin500+ (SSH+Bit)",13.1,10.7,13,16.7,"",3273.2,900,10.9,5.4,240,6,"6,0 x 240",70,14,180,"+R","TX 30","RAPID® S-14","Scheibenkopf","Reibteil","HiLo-Teilgewinde, Kernrippen","YellWin 500+",null,"ETA","ETA 12/0373",20,"LE003B","1359-CPD-0519",null,null,3.9,4.3,"H",3.9,3900]
[null,"Essve WH","Disc","Essve part.thrd. washer","2333740602600001",null,null,null,"Essve WH S-14, 6,0 x 260/70","HILO/KR/T30/YellWin500+ (SSH+Bit)",13.1,10.7,13,16.7,"",3273.2,900,10.9,5.4,260,6,"6,0 x 260",70,14,180,"+R","TX 30","RAPID® S-14","Scheibenkopf","Reibteil","HiLo-Teilgewinde, Kernrippen","YellWin 500+",null,"ETA","ETA 12/0373",20,"LE003B","1359-CPD-0519",null,null,3.9,4.3,"H",3.9,3900]
[null,"Essve WH","Disc","Essve part.thrd. washer","2333740602800001",null,null,null,"Essve WH S-14, 6,0 x 280/70","HILO/KR/T30/YellWin500+ (SSH+Bit)",13.1,10.7,13,16.7,"",3273.2,900,10.9,5.4,280,6,"6,0 x 280",70,14,180,"+R","TX 30","RAPID® S-14","Scheibenkopf","Reibteil","HiLo-Teilgewinde, Kernrippen","YellWin 500+",null,"ETA","ETA 12/0373",20,"LE003B","1359-CPD-0519",null,null,3.9,4.3,"H",3.9,3900]
[null,"Essve WH","Disc","Essve part.thrd. washer","2333740603000001",null,null,null,"Essve WH S-14, 6,0 x 300/70","HILO/KR/T30/YellWin500+ (SSH+Bit)",13.1,10.7,13,16.7,"",3273.2,900,10.9,5.4,300,6,"6,0 x 300",70,14,180,"+R","TX 30","RAPID® S-14","Scheibenkopf","Reibteil","HiLo-Teilgewinde, Kernrippen","YellWin 500+",null,"ETA","ETA 12/0373",20,"LE003B","1359-CPD-0519",null,null,3.9,4.3,"H",3.9,3900]
[null,"Essve WH","Disc","Essve part.thrd. washer","2333740801800001","080x180/100","F1F 1D0 A2C","C","Essve WH S-20, 8,0 x 180/100","HILO/KR/T40/YellWin500+ (SSH+Bit)",23.3,22.6,10.9,17.600000000000001,"",7040.0000000000009,900,28,11.2,180,8,"8,0 x 180",100,20,180,"+R","TX 40","RAPID® S-20","Scheibenkopf","Reibteil","HiLo-Teilgewinde, Kernrippen","YellWin 500+","Z-9.1-564, Z-9.1-509","ETA","ETA 12/0373",20,"LE003B","1359-CPD-0519","SSH_ETA.lab","D4",5.3,5.9,"H",5.3,5300]
[null,"Essve WH","Disc","Essve part.thrd. washer","2333740802000001","080x200/100","F1F 1D0 A2C","C","Essve WH S-20, 8,0 x 200/100","HILO/KR/T40/YellWin500+ (SSH+Bit)",23.3,22.6,10.9,17.600000000000001,"",7040.0000000000009,900,28,11.2,200,8,"8,0 x 200",100,20,180,"+R","TX 40","RAPID® S-20","Scheibenkopf","Reibteil","HiLo-Teilgewinde, Kernrippen","YellWin 500+","Z-9.1-564, Z-9.1-509","ETA","ETA 12/0373",20,"LE003B","1359-CPD-0519","SSH_ETA.lab","D4",5.3,5.9,"H",5.3,5300]
[null,"Essve WH","Disc","Essve part.thrd. washer","2333740802200001","080x220/100","F1F 1D0 A2C","C","Essve WH S-20, 8,0 x 220/100","HILO/KR/T40/YellWin500+ (SSH+Bit)",23.3,22.6,10.9,17.600000000000001,"",7040.0000000000009,900,28,11.2,220,8,"8,0 x 220",100,20,180,"+R","TX 40","RAPID® S-20","Scheibenkopf","Reibteil","HiLo-Teilgewinde, Kernrippen","YellWin 500+","Z-9.1-564, Z-9.1-509","ETA","ETA 12/0373",20,"LE003B","1359-CPD-0519","SSH_ETA.lab","D4",5.3,5.9,"H",5.3,5300]
[null,"Essve WH","Disc","Essve part.thrd. washer","2333740802400001","080x240/100","F1F 1D0 A2C","C","Essve WH S-20, 8,0 x 240/100","HILO/KR/T40/YellWin500+ (SSH+Bit)",23.3,22.6,10.9,17.600000000000001,"",7040.0000000000009,900,28,11.2,240,8,"8,0 x 240",100,20,180,"+R","TX 40","RAPID® S-20","Scheibenkopf","Reibteil","HiLo-Teilgewinde, Kernrippen","YellWin 500+","Z-9.1-564, Z-9.1-509","ETA","ETA 12/0373",20,"LE003B","1359-CPD-0519","SSH_ETA.lab","D4",5.3,5.9,"H",5.3,5300]
[null,"Essve WH","Disc","Essve part.thrd. washer","2333740802600001","080x260/100","F1F 1D0 A2C","C","Essve WH S-20, 8,0 x 260/100","HILO/KR/T40/YellWin500+ (SSH+Bit)",23.3,22.6,10.9,17.600000000000001,"",7040.0000000000009,900,28,11.2,260,8,"8,0 x 260",100,20,180,"+R","TX 40","RAPID® S-20","Scheibenkopf","Reibteil","HiLo-Teilgewinde, Kernrippen","YellWin 500+","Z-9.1-564, Z-9.1-509","ETA","ETA 12/0373",20,"LE003B","1359-CPD-0519","SSH_ETA.lab","D4",5.3,5.9,"H",5.3,5300]
[null,"Essve WH","Disc","Essve part.thrd. washer","2333740802800001","080x280/100","F1F 1D0 A2C","C","Essve WH S-20, 8,0 x 280/100","HILO/KR/T40/YellWin500+ (SSH+Bit)",23.3,22.6,10.9,17.600000000000001,"",7040.0000000000009,900,28,11.2,280,8,"8,0 x 280",100,20,180,"+R","TX 40","RAPID® S-20","Scheibenkopf","Reibteil","HiLo-Teilgewinde, Kernrippen","YellWin 500+","Z-9.1-564, Z-9.1-509","ETA","ETA 12/0373",20,"LE003B","1359-CPD-0519","SSH_ETA.lab","D4",5.3,5.9,"H",5.3,5300]
[null,"Essve WH","Disc","Essve part.thrd. washer","2333740803000001","080x300/100","F1F 1D0 A2C","C","Essve WH S-20, 8,0 x 300/100","HILO/KR/T40/YellWin500+ (SSH+Bit)",23.3,22.6,10.9,17.600000000000001,"",7040.0000000000009,900,28,11.2,300,8,"8,0 x 300",100,20,180,"+R","TX 40","RAPID® S-20","Scheibenkopf","Reibteil","HiLo-Teilgewinde, Kernrippen","YellWin 500+","Z-9.1-564, Z-9.1-509","ETA","ETA 12/0373",20,"LE003B","1359-CPD-0519","SSH_ETA.lab","D4",5.3,5.9,"H",5.3,5300]
[null,"Essve WH","Disc","Essve part.thrd. washer","2333740803200001","080x320/100","F1F 1D0 A2C","C","Essve WH S-20, 8,0 x 320/100","HILO/KR/T40/YellWin500+ (SSH+Bit)",23.3,22.6,10.9,17.600000000000001,"",7040.0000000000009,900,28,11.2,320,8,"8,0 x 320",100,20,180,"+R","TX 40","RAPID® S-20","Scheibenkopf","Reibteil","HiLo-Teilgewinde, Kernrippen","YellWin 500+","Z-9.1-564, Z-9.1-509","ETA","ETA 12/0373",20,"LE003B","1359-CPD-0519","SSH_ETA.lab","D4",5.3,5.9,"H",5.3,5300]
[null,"Essve WH","Disc","Essve part.thrd. washer","2333740803400001","080x340/100","F1F 1D0 A2C","C","Essve WH S-20, 8,0 x 340/100","HILO/KR/T40/YellWin500+ (SSH+Bit)",23.3,22.6,10.9,17.600000000000001,"",7040.0000000000009,900,28,11.2,340,8,"8,0 x 340",100,20,180,"+R","TX 40","RAPID® S-20","Scheibenkopf","Reibteil","HiLo-Teilgewinde, Kernrippen","YellWin 500+","Z-9.1-564, Z-9.1-509","ETA","ETA 12/0373",20,"LE003B","1359-CPD-0519","SSH_ETA.lab","D4",5.3,5.9,"H",5.3,5300]
[null,"Essve WH","Disc","Essve part.thrd. washer","2333740803600001","080x360/100","F1F 1D0 A2C","C","Essve WH S-20, 8,0 x 360/100","HILO/KR/T40/YellWin500+ (SSH+Bit)",23.3,22.6,10.9,17.600000000000001,"",7040.0000000000009,900,28,11.2,360,8,"8,0 x 360",100,20,180,"+R","TX 40","RAPID® S-20","Scheibenkopf","Reibteil","HiLo-Teilgewinde, Kernrippen","YellWin 500+","Z-9.1-564, Z-9.1-509","ETA","ETA 12/0373",20,"LE003B","1359-CPD-0519","SSH_ETA.lab","D4",5.3,5.9,"H",5.3,5300]
[null,"Essve WH","Disc","Essve part.thrd. washer","2333740803800001","080x380/100","F1F 1D0 A2C","C","Essve WH S-20, 8,0 x 380/100","HILO/KR/T40/YellWin500+ (SSH+Bit)",23.3,22.6,10.9,17.600000000000001,"",7040.0000000000009,900,28,11.2,380,8,"8,0 x 380",100,20,180,"+R","TX 40","RAPID® S-20","Scheibenkopf","Reibteil","HiLo-Teilgewinde, Kernrippen","YellWin 500+","Z-9.1-564, Z-9.1-509","ETA","ETA 12/0373",20,"LE003B","1359-CPD-0519","SSH_ETA.lab","D4",5.3,5.9,"H",5.3,5300]
[null,"Essve WH","Disc","Essve part.thrd. washer","2333740804000001","080x400/100","F1F 1D0 A2C","C","Essve WH S-20, 8,0 x 400/100","HILO/KR/T40/YellWin500+ (SSH+Bit)",23.3,22.6,10.9,17.600000000000001,"",7040.0000000000009,900,28,11.2,400,8,"8,0 x 400",100,20,180,"+R","TX 40","RAPID® S-20","Scheibenkopf","Reibteil","HiLo-Teilgewinde, Kernrippen","YellWin 500+","Z-9.1-564, Z-9.1-509","ETA","ETA 12/0373",20,"LE003B","1359-CPD-0519","SSH_ETA.lab","D4",5.3,5.9,"H",5.3,5300]
[null,"Essve WH","Disc","Essve part.thrd. washer","2333740804500001","080x450/100","F1F 1D0 A2C","C","Essve WH S-20, 8,0 x 450/100","HILO/KR/T40/YellWin500+ (SSH+Bit)",23.3,22.6,10.9,17.600000000000001,"",7040.0000000000009,900,28,11.2,450,8,"8,0 x 450",100,20,180,"+R","TX 40","RAPID® S-20","Scheibenkopf","Reibteil","HiLo-Teilgewinde, Kernrippen","YellWin 500+","Z-9.1-564, Z-9.1-509","ETA","ETA 12/0373",20,"LE003B","1359-CPD-0519","SSH_ETA.lab","D4",5.3,5.9,"H",5.3,5300]
[null,"Essve WH","Disc","Essve part.thrd. washer","2333740805000001","080x500/100","F1F 1D0 A2C","C","Essve WH S-20, 8,0 x 500/100","HILO/KR/T40/YellWin500+ (SSH+Bit)",23.3,22.6,10.9,17.600000000000001,"",7040.0000000000009,900,28,11.2,500,8,"8,0 x 500",100,20,180,"+R","TX 40","RAPID® S-20","Scheibenkopf","Reibteil","HiLo-Teilgewinde, Kernrippen","YellWin 500+","Z-9.1-564, Z-9.1-509","ETA","ETA 12/0373",20,"LE003B","1359-CPD-0519","SSH_ETA.lab","D4",5.3,5.9,"H",5.3,5300]
[null,"Essve WH","Disc","Essve part.thrd. washer","2333741001800001","100x180/100","F1F 1D0 A2C","C","Essve WH S-25, 10,0 x 180/100","HILO/KR/T50/YellWin500+ (SSH+Bit)",35,33.6,11,15.2,"",9500,900,52.5,17,180,10,"10,0 x 180",100,25,180,"+R","TX 50","RAPID® S-25","Scheibenkopf","Reibteil","HiLo-Teilgewinde, Kernrippen","YellWin 500+","Z-9.1-564, Z-9.1-509","ETA","ETA 12/0373",20,"LE003B","1359-CPD-0519","SSH_ETA.lab","D4",6.7,7.1,"H",6.7,6700]
[null,"Essve WH","Disc","Essve part.thrd. washer","2333741002000001","100x200/100","F1F 1D0 A2C","C","Essve WH S-25, 10,0 x 200/100","HILO/KR/T50/YellWin500+ (SSH+Bit)",35,33.6,11,15.2,"",9500,900,52.5,17,200,10,"10,0 x 200",100,25,180,"+R","TX 50","RAPID® S-25","Scheibenkopf","Reibteil","HiLo-Teilgewinde, Kernrippen","YellWin 500+","Z-9.1-564, Z-9.1-509","ETA","ETA 12/0373",20,"LE003B","1359-CPD-0519","SSH_ETA.lab","D4",6.7,7.1,"H",6.7,6700]
[null,"Essve WH","Disc","Essve part.thrd. washer","2333741002200001","100x220/100","F1F 1D0 A2C","C","Essve WH S-25, 10,0 x 220/100","HILO/KR/T50/YellWin500+ (SSH+Bit)",35,33.6,11,15.2,"",9500,900,52.5,17,220,10,"10,0 x 220",100,25,180,"+R","TX 50","RAPID® S-25","Scheibenkopf","Reibteil","HiLo-Teilgewinde, Kernrippen","YellWin 500+","Z-9.1-564, Z-9.1-509","ETA","ETA 12/0373",20,"LE003B","1359-CPD-0519","SSH_ETA.lab","D4",6.7,7.1,"H",6.7,6700]
[null,"Essve WH","Disc","Essve part.thrd. washer","2333741002400001","100x240/100","F1F 1D0 A2C","C","Essve WH S-25, 10,0 x 240/100","HILO/KR/T50/YellWin500+ (SSH+Bit)",35,33.6,11,15.2,"",9500,900,52.5,17,240,10,"10,0 x 240",100,25,180,"+R","TX 50","RAPID® S-25","Scheibenkopf","Reibteil","HiLo-Teilgewinde, Kernrippen","YellWin 500+","Z-9.1-564, Z-9.1-509","ETA","ETA 12/0373",20,"LE003B","1359-CPD-0519","SSH_ETA.lab","D4",6.7,7.1,"H",6.7,6700]
[null,"Essve WH","Disc","Essve part.thrd. washer","2333741002600001","100x260/100","F1F 1D0 A2C","C","Essve WH S-25, 10,0 x 260/100","HILO/KR/T50/YellWin500+ (SSH+Bit)",35,33.6,11,15.2,"",9500,900,52.5,17,260,10,"10,0 x 260",100,25,180,"+R","TX 50","RAPID® S-25","Scheibenkopf","Reibteil","HiLo-Teilgewinde, Kernrippen","YellWin 500+","Z-9.1-564, Z-9.1-509","ETA","ETA 12/0373",20,"LE003B","1359-CPD-0519","SSH_ETA.lab","D4",6.7,7.1,"H",6.7,6700]
[null,"Essve WH","Disc","Essve part.thrd. washer","2333741002800001","100x280/100","F1F 1D0 A2C","C","Essve WH S-25, 10,0 x 280/100","HILO/KR/T50/YellWin500+ (SSH+Bit)",35,33.6,11,15.2,"",9500,900,52.5,17,280,10,"10,0 x 280",100,25,180,"+R","TX 50","RAPID® S-25","Scheibenkopf","Reibteil","HiLo-Teilgewinde, Kernrippen","YellWin 500+","Z-9.1-564, Z-9.1-509","ETA","ETA 12/0373",20,"LE003B","1359-CPD-0519","SSH_ETA.lab","D4",6.7,7.1,"H",6.7,6700]
[null,"Essve WH","Disc","Essve part.thrd. washer","2333741003000001","100x300/100","F1F 1D0 A2C","C","Essve WH S-25, 10,0 x 300/100","HILO/KR/T50/YellWin500+ (SSH+Bit)",35,33.6,11,15.2,"",9500,900,52.5,17,300,10,"10,0 x 300",100,25,180,"+R","TX 50","RAPID® S-25","Scheibenkopf","Reibteil","HiLo-Teilgewinde, Kernrippen","YellWin 500+","Z-9.1-564, Z-9.1-509","ETA","ETA 12/0373",20,"LE003B","1359-CPD-0519","SSH_ETA.lab","D4",6.7,7.1,"H",6.7,6700]
[null,"Essve WH","Disc","Essve part.thrd. washer","2333741003200001","100x320/120","F1F 1D0 A2C","C","Essve WH S-25, 10,0 x 320/100","HILO/KR/T50/YellWin500+ (SSH+Bit)",35,33.6,11,15.2,"",9500,900,52.5,17,320,10,"10,0 x 320",100,25,180,"+R","TX 50","RAPID® S-25","Scheibenkopf","Reibteil","HiLo-Teilgewinde, Kernrippen","YellWin 500+","Z-9.1-564, Z-9.1-509","ETA","ETA 12/0373",20,"LE003B","1359-CPD-0519","SSH_ETA.lab","D4",6.7,7.1,"H",6.7,6700]
[null,"Essve WH","Disc","Essve part.thrd. washer","2333741003400001","100x340/120","F1F 1D0 A2C","C","Essve WH S-25, 10,0 x 340/100","HILO/KR/T50/YellWin500+ (SSH+Bit)",35,33.6,11,15.2,"",9500,900,52.5,17,340,10,"10,0 x 340",100,25,180,"+R","TX 50","RAPID® S-25","Scheibenkopf","Reibteil","HiLo-Teilgewinde, Kernrippen","YellWin 500+","Z-9.1-564, Z-9.1-509","ETA","ETA 12/0373",20,"LE003B","1359-CPD-0519","SSH_ETA.lab","D4",6.7,7.1,"H",6.7,6700]
[null,"Essve WH","Disc","Essve part.thrd. washer","2333741003600001","100x360/120","F1F 1D0 A2C","C","Essve WH S-25, 10,0 x 360/100","HILO/KR/T50/YellWin500+ (SSH+Bit)",35,33.6,11,15.2,"",9500,900,52.5,17,360,10,"10,0 x 360",100,25,180,"+R","TX 50","RAPID® S-25","Scheibenkopf","Reibteil","HiLo-Teilgewinde, Kernrippen","YellWin 500+","Z-9.1-564, Z-9.1-509","ETA","ETA 12/0373",20,"LE003B","1359-CPD-0519","SSH_ETA.lab","D4",6.7,7.1,"H",6.7,6700]
[null,"Essve WH","Disc","Essve part.thrd. washer","2333741003800001","100x380/120","F1F 1D0 A2C","C","Essve WH S-25, 10,0 x 380/100","HILO/KR/T50/YellWin500+ (SSH+Bit)",35,33.6,11,15.2,"",9500,900,52.5,17,380,10,"10,0 x 380",100,25,180,"+R","TX 50","RAPID® S-25","Scheibenkopf","Reibteil","HiLo-Teilgewinde, Kernrippen","YellWin 500+","Z-9.1-564, Z-9.1-509","ETA","ETA 12/0373",20,"LE003B","1359-CPD-0519","SSH_ETA.lab","D4",6.7,7.1,"H",6.7,6700]
[null,"Essve WH","Disc","Essve part.thrd. washer","2333741004000001","100x400/120","F1F 1D0 A2C","C","Essve WH S-25, 10,0 x 400/100","HILO/KR/T50/YellWin500+ (SSH+Bit)",35,33.6,11,15.2,"",9500,900,52.5,17,400,10,"10,0 x 400",100,25,180,"+R","TX 50","RAPID® S-25","Scheibenkopf","Reibteil","HiLo-Teilgewinde, Kernrippen","YellWin 500+","Z-9.1-564, Z-9.1-509","ETA","ETA 12/0373",20,"LE003B","1359-CPD-0519","SSH_ETA.lab","D4",6.7,7.1,"H",6.7,6700]
[null,"Essve WH","Disc","Essve part.thrd. washer","2333741004500001","100x450/120","F1F 1D0 A2C","C","Essve WH S-25, 10,0 x 450/100","HILO/KR/T50/YellWin500+ (SSH+Bit)",35,33.6,11,15.2,"",9500,900,52.5,17,450,10,"10,0 x 450",100,25,180,"+R","TX 50","RAPID® S-25","Scheibenkopf","Reibteil","HiLo-Teilgewinde, Kernrippen","YellWin 500+","Z-9.1-564, Z-9.1-509","ETA","ETA 12/0373",20,"LE003B","1359-CPD-0519","SSH_ETA.lab","D4",6.7,7.1,"H",6.7,6700]
[null,"Essve WH","Disc","Essve part.thrd. washer","2333741005000001","100x500/120","F1F 1D0 A2C","C","Essve WH S-25, 10,0 x 500/100","HILO/KR/T50/YellWin500+ (SSH+Bit)",35,33.6,11,15.2,"",9500,900,52.5,17,500,10,"10,0 x 500",100,25,180,"+R","TX 50","RAPID® S-25","Scheibenkopf","Reibteil","HiLo-Teilgewinde, Kernrippen","YellWin 500+","Z-9.1-564, Z-9.1-509","ETA","ETA 12/0373",20,"LE003B","1359-CPD-0519","SSH_ETA.lab","D4",6.7,7.1,"H",6.7,6700]
["slst_1_3","Essve C-FH","Disc","Essve part.thrd C-FH","2331710601800001","060x180/070","G1C 1B1 A2B","B","Essve C-FH  6,0 x 180/70","HILO/KR/T30/BlueWin700+ (SSH+Bit)",13.1,10.7,13,19.7,"",3329.2999999999997,900,10.9,5.4,180,6,"6,0 x 180",70,13,180,"+R","TX 30","Essve C-FH","Kombi-Kopf","Reibteil","HiLo-Teilgewinde, Kernrippen","BlueWin 700+",null,"ETA","ETA 12/0373",20,"LE003B","1359-CPD-0519","SSH_ETA_neueSchriftart.lab","D1neu",3.9,4.3,"H",3.9,3900]
[null,"Essve C-FH","Disc","Essve part.thrd C-FH","2331710602000001","060x200/070","G1C 1B1 A2B","B","Essve C-FH  6,0 x 200/70","HILO/KR/T30/BlueWin700+ (SSH+Bit)",13.1,10.7,13,19.7,"",3329.2999999999997,900,10.9,5.4,200,6,"6,0 x 200",70,13,180,"+R","TX 30","Essve C-FH","Kombi-Kopf","Reibteil","HiLo-Teilgewinde, Kernrippen","BlueWin 700+",null,"ETA","ETA 12/0373",20,"LE003B","1359-CPD-0519","SSH_ETA_neueSchriftart.lab","D1neu",3.9,4.3,"H",3.9,3900]
[null,"Essve C-FH","Disc","Essve part.thrd C-FH","2331710801800001","080x180/100","G1C 1B1 A2B","B","Essve C-FH  8,0 x 180/100","HILO/KR/T40/BlueWin700+ (SSH+Bit)",23.3,22.6,10.9,22.9,"",8266.9,900,28,11.2,180,8,"8,0 x 180",100,19,180,"+R","TX 40","Essve C-FH","Kombi-Kopf","Reibteil","HiLo-Teilgewinde, Kernrippen","BlueWin 700+",null,"ETA","ETA 12/0373",20,"LE003B","1359-CPD-0519","SSH_ETA_neueSchriftart.lab","D1neu",5.3,5.9,"H",5.3,5300]
[null,"Essve C-FH","Disc","Essve part.thrd C-FH","2331710802000001","080x200/100","G1C 1B1 A2B","B","Essve C-FH  8,0 x 200/100","HILO/KR/T40/BlueWin700+ (SSH+Bit)",23.3,22.6,10.9,22.9,"",8266.9,900,28,11.2,200,8,"8,0 x 200",100,19,180,"+R","TX 40","Essve C-FH","Kombi-Kopf","Reibteil","HiLo-Teilgewinde, Kernrippen","BlueWin 700+",null,"ETA","ETA 12/0373",20,"LE003B","1359-CPD-0519","SSH_ETA_neueSchriftart.lab","D1neu",5.3,5.9,"H",5.3,5300]
[null,"Essve C-FH","Disc","Essve part.thrd C-FH","2331710802200001","080x220/100","G1C 1B1 A2B","B","Essve C-FH  8,0 x 220/100","HILO/KR/T40/BlueWin700+ (SSH+Bit)",23.3,22.6,10.9,22.9,"",8266.9,900,28,11.2,220,8,"8,0 x 220",100,19,180,"+R","TX 40","Essve C-FH","Kombi-Kopf","Reibteil","HiLo-Teilgewinde, Kernrippen","BlueWin 700+",null,"ETA","ETA 12/0373",20,"LE003B","1359-CPD-0519","SSH_ETA_neueSchriftart.lab","D1neu",5.3,5.9,"H",5.3,5300]
[null,"Essve C-FH","Disc","Essve part.thrd C-FH","2331710802400001","080x240/100","G1C 1B1 A2B","B","Essve C-FH  8,0 x 240/100","HILO/KR/T40/BlueWin700+ (SSH+Bit)",23.3,22.6,10.9,22.9,"",8266.9,900,28,11.2,240,8,"8,0 x 240",100,19,180,"+R","TX 40","Essve C-FH","Kombi-Kopf","Reibteil","HiLo-Teilgewinde, Kernrippen","BlueWin 700+",null,"ETA","ETA 12/0373",20,"LE003B","1359-CPD-0519","SSH_ETA_neueSchriftart.lab","D1neu",5.3,5.9,"H",5.3,5300]
[null,"Essve C-FH","Disc","Essve part.thrd C-FH","2331710802600001","080x260/100","G1C 1B1 A2B","B","Essve C-FH  8,0 x 260/100","HILO/KR/T40/BlueWin700+ (SSH+Bit)",23.3,22.6,10.9,22.9,"",8266.9,900,28,11.2,260,8,"8,0 x 260",100,19,180,"+R","TX 40","Essve C-FH","Kombi-Kopf","Reibteil","HiLo-Teilgewinde, Kernrippen","BlueWin 700+",null,"ETA","ETA 12/0373",20,"LE003B","1359-CPD-0519","SSH_ETA_neueSchriftart.lab","D1neu",5.3,5.9,"H",5.3,5300]
[null,"Essve C-FH","Disc","Essve part.thrd C-FH","2331710802800001","080x280/100","G1C 1B1 A2B","B","Essve C-FH  8,0 x 280/100","HILO/KR/T40/BlueWin700+ (SSH+Bit)",23.3,22.6,10.9,22.9,"",8266.9,900,28,11.2,280,8,"8,0 x 280",100,19,180,"+R","TX 40","Essve C-FH","Kombi-Kopf","Reibteil","HiLo-Teilgewinde, Kernrippen","BlueWin 700+",null,"ETA","ETA 12/0373",20,"LE003B","1359-CPD-0519","SSH_ETA_neueSchriftart.lab","D1neu",5.3,5.9,"H",5.3,5300]
[null,"Essve C-FH","Disc","Essve part.thrd C-FH","2331710803000001","080x300/100","G1C 1B1 A2B","B","Essve C-FH  8,0 x 300/100","HILO/KR/T40/BlueWin700+ (SSH+Bit)",23.3,22.6,10.9,22.9,"",8266.9,900,28,11.2,300,8,"8,0 x 300",100,19,180,"+R","TX 40","Essve C-FH","Kombi-Kopf","Reibteil","HiLo-Teilgewinde, Kernrippen","BlueWin 700+",null,"ETA","ETA 12/0373",20,"LE003B","1359-CPD-0519","SSH_ETA_neueSchriftart.lab","D1neu",5.3,5.9,"H",5.3,5300]
[null,"Essve C-FH","Disc","Essve part.thrd C-FH","2331710803200001","080x320/100","G1C 1B1 A2B","B","Essve C-FH  8,0 x 320/100","HILO/KR/T40/BlueWin700+ (SSH+Bit)",23.3,22.6,10.9,22.9,"",8266.9,900,28,11.2,320,8,"8,0 x 320",100,19,180,"+R","TX 40","Essve C-FH","Kombi-Kopf","Reibteil","HiLo-Teilgewinde, Kernrippen","BlueWin 700+",null,"ETA","ETA 12/0373",20,"LE003B","1359-CPD-0519","SSH_ETA_neueSchriftart.lab","D1neu",5.3,5.9,"H",5.3,5300]
[null,"Essve C-FH","Disc","Essve part.thrd C-FH","2331710803400001","080x340/100","G1C 1B1 A2B","B","Essve C-FH  8,0 x 340/100","HILO/KR/T40/BlueWin700+ (SSH+Bit)",23.3,22.6,10.9,22.9,"",8266.9,900,28,11.2,340,8,"8,0 x 340",100,19,180,"+R","TX 40","Essve C-FH","Kombi-Kopf","Reibteil","HiLo-Teilgewinde, Kernrippen","BlueWin 700+",null,"ETA","ETA 12/0373",20,"LE003B","1359-CPD-0519","SSH_ETA_neueSchriftart.lab","D1neu",5.3,5.9,"H",5.3,5300]
[null,"Essve C-FH","Disc","Essve part.thrd C-FH","2331710803600001","080x360/100","G1C 1B1 A2B","B","Essve C-FH  8,0 x 360/100","HILO/KR/T40/BlueWin700+ (SSH+Bit)",23.3,22.6,10.9,22.9,"",8266.9,900,28,11.2,360,8,"8,0 x 360",100,19,180,"+R","TX 40","Essve C-FH","Kombi-Kopf","Reibteil","HiLo-Teilgewinde, Kernrippen","BlueWin 700+",null,"ETA","ETA 12/0373",20,"LE003B","1359-CPD-0519","SSH_ETA_neueSchriftart.lab","D1neu",5.3,5.9,"H",5.3,5300]
[null,"Essve C-FH","Disc","Essve part.thrd C-FH","2331710803800001","080x380/100","G1C 1B1 A2B","B","Essve C-FH  8,0 x 380/100","HILO/KR/T40/BlueWin700+ (SSH+Bit)",23.3,22.6,10.9,22.9,"",8266.9,900,28,11.2,380,8,"8,0 x 380",100,19,180,"+R","TX 40","Essve C-FH","Kombi-Kopf","Reibteil","HiLo-Teilgewinde, Kernrippen","BlueWin 700+",null,"ETA","ETA 12/0373",20,"LE003B","1359-CPD-0519","SSH_ETA_neueSchriftart.lab","D1neu",5.3,5.9,"H",5.3,5300]
[null,"Essve C-FH","Disc","Essve part.thrd C-FH","2331710804000001","080x400/100","G1C 1B1 A2B","B","Essve C-FH  8,0 x 400/100","HILO/KR/T40/BlueWin700+ (SSH+Bit)",23.3,22.6,10.9,22.9,"",8266.9,900,28,11.2,400,8,"8,0 x 400",100,19,180,"+R","TX 40","Essve C-FH","Kombi-Kopf","Reibteil","HiLo-Teilgewinde, Kernrippen","BlueWin 700+",null,"ETA","ETA 12/0373",20,"LE003B","1359-CPD-0519","SSH_ETA_neueSchriftart.lab","D1neu",5.3,5.9,"H",5.3,5300]
[null,"Essve C-FH","Disc","Essve part.thrd C-FH","2331711001800001","100x180/100","G1C 1B1 A2B","B","Essve C-FH  10,0 x 180/100","HILO/KR/T50/BlueWin700+ (SSH+Bit)",35,33.6,11,12.3,"",7084.8,900,52.5,14.2,180,10,"10,0 x 180",100,24,180,"+R","TX 50","Essve C-FH","Kombi-Kopf","Reibteil","HiLo-Teilgewinde, Kernrippen","BlueWin 700+",null,"ETA","ETA 12/0373",20,"LE003B","1359-CPD-0519","SSH_ETA_neueSchriftart.lab","D1neu",6.7,7.1,"H",6.7,6700]
[null,"Essve C-FH","Disc","Essve part.thrd C-FH","2331711002000001","100x200/100","G1C 1B1 A2B","B","Essve C-FH  10,0 x 200/100","HILO/KR/T50/BlueWin700+ (SSH+Bit)",35,33.6,11,12.3,"",7084.8,900,52.5,14.2,200,10,"10,0 x 200",100,24,180,"+R","TX 50","Essve C-FH","Kombi-Kopf","Reibteil","HiLo-Teilgewinde, Kernrippen","BlueWin 700+",null,"ETA","ETA 12/0373",20,"LE003B","1359-CPD-0519","SSH_ETA_neueSchriftart.lab","D1neu",6.7,7.1,"H",6.7,6700]
[null,"Essve C-FH","Disc","Essve part.thrd C-FH","2331711002200001","100x220/100","G1C 1B1 A2B","B","Essve C-FH  10,0 x 220/100","HILO/KR/T50/BlueWin700+ (SSH+Bit)",35,33.6,11,12.3,"",7084.8,900,52.5,14.2,220,10,"10,0 x 220",100,24,180,"+R","TX 50","Essve C-FH","Kombi-Kopf","Reibteil","HiLo-Teilgewinde, Kernrippen","BlueWin 700+",null,"ETA","ETA 12/0373",20,"LE003B","1359-CPD-0519","SSH_ETA_neueSchriftart.lab","D1neu",6.7,7.1,"H",6.7,6700]
[null,"Essve C-FH","Disc","Essve part.thrd C-FH","2331711002400001","100x240/100","G1C 1B1 A2B","B","Essve C-FH  10,0 x 240/100","HILO/KR/T50/BlueWin700+ (SSH+Bit)",35,33.6,11,12.3,"",7084.8,900,52.5,14.2,240,10,"10,0 x 240",100,24,180,"+R","TX 50","Essve C-FH","Kombi-Kopf","Reibteil","HiLo-Teilgewinde, Kernrippen","BlueWin 700+",null,"ETA","ETA 12/0373",20,"LE003B","1359-CPD-0519","SSH_ETA_neueSchriftart.lab","D1neu",6.7,7.1,"H",6.7,6700]
[null,"Essve C-FH","Disc","Essve part.thrd C-FH","2331711002600001","100x260/100","G1C 1B1 A2B","B","Essve C-FH  10,0 x 260/100","HILO/KR/T50/BlueWin700+ (SSH+Bit)",35,33.6,11,12.3,"",7084.8,900,52.5,14.2,260,10,"10,0 x 260",100,24,180,"+R","TX 50","Essve C-FH","Kombi-Kopf","Reibteil","HiLo-Teilgewinde, Kernrippen","BlueWin 700+",null,"ETA","ETA 12/0373",20,"LE003B","1359-CPD-0519","SSH_ETA_neueSchriftart.lab","D1neu",6.7,7.1,"H",6.7,6700]
[null,"Essve C-FH","Disc","Essve part.thrd C-FH","2331711002800001","100x280/100","G1C 1B1 A2B","B","Essve C-FH  10,0 x 280/100","HILO/KR/T50/BlueWin700+ (SSH+Bit)",35,33.6,11,12.3,"",7084.8,900,52.5,14.2,280,10,"10,0 x 280",100,24,180,"+R","TX 50","Essve C-FH","Kombi-Kopf","Reibteil","HiLo-Teilgewinde, Kernrippen","BlueWin 700+",null,"ETA","ETA 12/0373",20,"LE003B","1359-CPD-0519","SSH_ETA_neueSchriftart.lab","D1neu",6.7,7.1,"H",6.7,6700]
[null,"Essve C-FH","Disc","Essve part.thrd C-FH","2331711003000001","100x300/120","G1C 1B1 A2B","B","Essve C-FH  10,0 x 300/100","HILO/KR/T50/BlueWin700+ (SSH+Bit)",35,33.6,11,12.3,"",7084.8,900,52.5,14.2,300,10,"10,0 x 300",100,24,180,"+R","TX 50","Essve C-FH","Kombi-Kopf","Reibteil","HiLo-Teilgewinde, Kernrippen","BlueWin 700+",null,"ETA","ETA 12/0373",20,"LE003B","1359-CPD-0519","SSH_ETA_neueSchriftart.lab","D1neu",6.7,7.1,"H",6.7,6700]
[null,"Essve C-FH","Disc","Essve part.thrd C-FH","2331711003500001","100x350/120","G1C 1B1 A2B","B","Essve C-FH  10,0 x 350/100","HILO/KR/T50/BlueWin700+ (SSH+Bit)",35,33.6,11,12.3,"",7084.8,900,52.5,14.2,350,10,"10,0 x 350",100,24,180,"+R","TX 50","Essve C-FH","Kombi-Kopf","Reibteil","HiLo-Teilgewinde, Kernrippen","BlueWin 700+",null,"ETA","ETA 12/0373",20,"LE003B","1359-CPD-0519","SSH_ETA_neueSchriftart.lab","D1neu",6.7,7.1,"H",6.7,6700]
[null,"Essve C-FH","Disc","Essve part.thrd C-FH","2331711004000001","100x400/120","G1C 1B1 A2B","B","Essve C-FH  10,0 x 400/100","HILO/KR/T50/BlueWin700+ (SSH+Bit)",35,33.6,11,12.3,"",7084.8,900,52.5,14.2,400,10,"10,0 x 400",100,24,180,"+R","TX 50","Essve C-FH","Kombi-Kopf","Reibteil","HiLo-Teilgewinde, Kernrippen","BlueWin 700+",null,"ETA","ETA 12/0373",20,"LE003B","1359-CPD-0519","SSH_ETA_neueSchriftart.lab","D1neu",6.7,7.1,"H",6.7,6700]
["slst_1_4","Essve C-FT","countersunk","Essve Fullthread","1335740801200001","080x120/110","A0C 1A1 C1E","E","ESSVE C-FT  8,0 x 120/110","EG/KR+HSP/T40/YellWin500+ (SSH+Bit)",24.1,20.3,13.1,12.4,"",2790,950,25.8,8.6999999999999993,120,8,"8,0 x 120",110,15,90,null,"TX 40","RAPID® VOLLGEWINDE","Senkkopf, Unterkopfrippen",null,"EG-Vollgewinde, Halbspitze + Kernrippen","YellWin 500+","Z-9.1-656","ETA","ETA 12/0373",20,"LE005B","1359-CPD-0519","SSH_ETA.lab","D8",5.0999999999999996,"not relevant","H+W",5.0999999999999996,5100]
[null,"Essve C-FT","countersunk","Essve Fullthread","1335740801400001","080x140/130","A0C 1A1 C1E","E","ESSVE C-FT  8,0 x 140/130","EG/KR+HSP/T40/YellWin500+ (SSH+Bit)",24.1,20.3,13.1,12.4,"",2790,950,25.8,8.6999999999999993,140,8,"8,0 x 140",130,15,90,null,"TX 40","RAPID® VOLLGEWINDE","Senkkopf, Unterkopfrippen",null,"EG-Vollgewinde, Halbspitze + Kernrippen","YellWin 500+","Z-9.1-656","ETA","ETA 12/0373",20,"LE005B","1359-CPD-0519","SSH_ETA.lab","D8",5.0999999999999996,"not relevant","H+W",5.0999999999999996,5100]
[null,"Essve C-FT","countersunk","Essve Fullthread","1335740801600001","080x160/150","A0C 1A1 C1E","E","ESSVE C-FT  8,0 x 160/150","EG/KR+HSP/T40/YellWin500+ (SSH+Bit)",24.1,20.3,13.1,12.4,"",2790,950,25.8,8.6999999999999993,160,8,"8,0 x 160",150,15,90,null,"TX 40","RAPID® VOLLGEWINDE","Senkkopf, Unterkopfrippen",null,"EG-Vollgewinde, Halbspitze + Kernrippen","YellWin 500+","Z-9.1-656","ETA","ETA 12/0373",20,"LE005B","1359-CPD-0519","SSH_ETA.lab","D8",5.0999999999999996,"not relevant","H+W",5.0999999999999996,5100]
[null,"Essve C-FT","countersunk","Essve Fullthread","1335740801800001","080x180/170","A0C 1A1 C1E","E","ESSVE C-FT  8,0 x 180/170","EG/KR+HSP/T40/YellWin500+ (SSH+Bit)",24.1,20.3,13.1,12.4,"",2790,950,25.8,8.6999999999999993,180,8,"8,0 x 180",170,15,90,null,"TX 40","RAPID® VOLLGEWINDE","Senkkopf, Unterkopfrippen",null,"EG-Vollgewinde, Halbspitze + Kernrippen","YellWin 500+","Z-9.1-656, Z-9.1-509","ETA","ETA 12/0373",20,"LE005B","1359-CPD-0519","SSH_ETA.lab","D8",5.0999999999999996,"not relevant","H+W",5.0999999999999996,5100]
[null,"Essve C-FT","countersunk","Essve Fullthread","1335740802000001","080x200/190","A0C 1A1 C1E","E","ESSVE C-FT  8,0 x 200/190","EG/KR+HSP/T40/YellWin500+ (SSH+Bit)",24.1,20.3,13.1,12.4,"",2790,950,25.8,8.6999999999999993,200,8,"8,0 x 200",190,15,90,null,"TX 40","RAPID® VOLLGEWINDE","Senkkopf, Unterkopfrippen",null,"EG-Vollgewinde, Halbspitze + Kernrippen","YellWin 500+","Z-9.1-656, Z-9.1-509","ETA","ETA 12/0373",20,"LE005B","1359-CPD-0519","SSH_ETA.lab","D8",5.0999999999999996,"not relevant","H+W",5.0999999999999996,5100]
[null,"Essve C-FT","countersunk","Essve Fullthread","1335740802200001","080x220/210","A0C 1A1 C1E","E","ESSVE C-FT  8,0 x 220/210","EG/KR+HSP/T40/YellWin500+ (SSH+Bit)",24.1,20.3,13.1,12.4,"",2790,950,25.8,8.6999999999999993,220,8,"8,0 x 220",210,15,90,null,"TX 40","RAPID® VOLLGEWINDE","Senkkopf, Unterkopfrippen",null,"EG-Vollgewinde, Halbspitze + Kernrippen","YellWin 500+","Z-9.1-656, Z-9.1-509","ETA","ETA 12/0373",20,"LE005B","1359-CPD-0519","SSH_ETA.lab","D8",5.0999999999999996,"not relevant","H+W",5.0999999999999996,5100]
[null,"Essve C-FT","countersunk","Essve Fullthread","1335740802400001","080x240/230","A0C 1A1 C1E","E","ESSVE C-FT  8,0 x 240/230","EG/KR+HSP/T40/YellWin500+ (SSH+Bit)",24.1,20.3,13.1,12.4,"",2790,950,25.8,8.6999999999999993,240,8,"8,0 x 240",230,15,90,null,"TX 40","RAPID® VOLLGEWINDE","Senkkopf, Unterkopfrippen",null,"EG-Vollgewinde, Halbspitze + Kernrippen","YellWin 500+","Z-9.1-656, Z-9.1-509","ETA","ETA 12/0373",20,"LE005B","1359-CPD-0519","SSH_ETA.lab","D8",5.0999999999999996,"not relevant","H+W",5.0999999999999996,5100]
[null,"Essve C-FT","countersunk","Essve Fullthread","1335740802600001","080x260/250","A0C 1A1 C1E","E","ESSVE C-FT  8,0 x 260/250","EG/KR+HSP/T40/YellWin500+ (SSH+Bit)",24.1,20.3,13.1,12.4,"",2790,950,25.8,8.6999999999999993,260,8,"8,0 x 260",250,15,90,null,"TX 40","RAPID® VOLLGEWINDE","Senkkopf, Unterkopfrippen",null,"EG-Vollgewinde, Halbspitze + Kernrippen","YellWin 500+","Z-9.1-656, Z-9.1-509","ETA","ETA 12/0373",20,"LE005B","1359-CPD-0519","SSH_ETA.lab","D8",5.0999999999999996,"not relevant","H+W",5.0999999999999996,5100]
[null,"Essve C-FT","countersunk","Essve Fullthread","1335740802800001","080x280/270","A0C 1A1 C1E","E","ESSVE C-FT  8,0 x 280/270","EG/KR+HSP/T40/YellWin500+ (SSH+Bit)",24.1,20.3,13.1,12.4,{"$f":"IF(C141=\"Scheibe\",N141*0.6,\"\")","v":""},{"$f":"X141*X141*N141","v":2790},950,25.8,8.6999999999999993,280,8,"8,0 x 280",270,15,90,null,"TX 40","RAPID® VOLLGEWINDE","Senkkopf, Unterkopfrippen",null,"EG-Vollgewinde, Halbspitze + Kernrippen","YellWin 500+","Z-9.1-656, Z-9.1-509","ETA","ETA 12/0373",20,"LE005B","1359-CPD-0519","SSH_ETA.lab","D8",5.0999999999999996,"not relevant","H+W",5.0999999999999996,{"$f":"AR141*1000","v":5100}]
[null,"Essve C-FT","countersunk","Essve Fullthread","1335740803000001","080x300/290","A0C 1A1 C1E","E","ESSVE C-FT  8,0 x 300/290","EG/KR+HSP/T40/YellWin500+ (SSH+Bit)",24.1,20.3,13.1,12.4,"",2790,950,25.8,8.6999999999999993,300,8,"8,0 x 300",290,15,90,null,"TX 40","RAPID® VOLLGEWINDE","Senkkopf, Unterkopfrippen",null,"EG-Vollgewinde, Halbspitze + Kernrippen","YellWin 500+","Z-9.1-656, Z-9.1-509","ETA","ETA 12/0373",20,"LE005B","1359-CPD-0519","SSH_ETA.lab","D8",5.0999999999999996,"not relevant","H+W",5.0999999999999996,5100]
[null,"Essve C-FT","countersunk","Essve Fullthread","1335740803250001",null,null,null,"ESSVE C-FT  8,0 x 325/315","EG/KR+HSP/T40/YellWin500+ (SSH+Bit)",24.1,20.3,13.1,12.4,"",2790,950,25.8,8.6999999999999993,325,8,"8,0 x 325",315,15,90,null,"TX 40","RAPID® VOLLGEWINDE","Senkkopf, Unterkopfrippen",null,"EG-Vollgewinde, Halbspitze + Kernrippen","YellWin 500+",null,"ETA","ETA 12/0373",20,"LE005B","1359-CPD-0519",null,null,5.0999999999999996,"not relevant","H+W",5.0999999999999996,5100]
[null,"Essve C-FT","countersunk","Essve Fullthread","1335740803500001","080x350/340","A0C 1A1 C1E","E","ESSVE C-FT  8,0 x 350/340","EG/KR+HSP/T40/YellWin500+ (SSH+Bit)",24.1,20.3,13.1,12.4,"",2790,950,25.8,8.6999999999999993,350,8,"8,0 x 350",340,15,90,null,"TX 40","RAPID® VOLLGEWINDE","Senkkopf, Unterkopfrippen",null,"EG-Vollgewinde, Halbspitze + Kernrippen","YellWin 500+","Z-9.1-656, Z-9.1-509","ETA","ETA 12/0373",20,"LE005B","1359-CPD-0519","SSH_ETA.lab","D8",5.0999999999999996,"not relevant","H+W",5.0999999999999996,5100]
[null,"Essve C-FT","countersunk","Essve Fullthread","1335740803750001",null,null,null,"ESSVE C-FT  8,0 x 375/365","EG/KR+HSP/T40/YellWin500+ (SSH+Bit)",24.1,20.3,13.1,12.4,"",2790,950,25.8,8.6999999999999993,375,8,"8,0 x 375",365,15,90,null,"TX 40","RAPID® VOLLGEWINDE","Senkkopf, Unterkopfrippen",null,"EG-Vollgewinde, Halbspitze + Kernrippen","YellWin 500+",null,"ETA","ETA 12/0373",20,"LE005B","1359-CPD-0519",null,null,5.0999999999999996,"not relevant","H+W",5.0999999999999996,5100]
[null,"Essve C-FT","countersunk","Essve Fullthread","1335740804000001","080x400/390","A0C 1A1 C1E","E","ESSVE C-FT  8,0 x 400/390","EG/KR+HSP/T40/YellWin500+ (SSH+Bit)",24.1,20.3,13.1,12.4,"",2790,950,25.8,8.6999999999999993,400,8,"8,0 x 400",390,15,90,null,"TX 40","RAPID® VOLLGEWINDE","Senkkopf, Unterkopfrippen",null,"EG-Vollgewinde, Halbspitze + Kernrippen","YellWin 500+","Z-9.1-656, Z-9.1-509","ETA","ETA 12/0373",20,"LE005B","1359-CPD-0519","SSH_ETA.lab","D8",5.0999999999999996,"not relevant","H+W",5.0999999999999996,5100]
[null,"Essve C-FT","countersunk","Essve Fullthread","1335740804500001","080x450/427","A0C 1A1 C1E","E","ESSVE C-FT  8,0 x 450/427","EG/KR+HSP/T40/YellWin500+ (SSH+Bit)",24.1,20.3,13.1,12.4,"",2790,950,25.8,8.6999999999999993,450,8,"8,0 x 450",427,15,90,null,"TX 40","RAPID® VOLLGEWINDE","Senkkopf, Unterkopfrippen",null,"EG-Vollgewinde, Halbspitze + Kernrippen","YellWin 500+","Z-9.1-656, Z-9.1-509","ETA","ETA 12/0373",20,"LE005B","1359-CPD-0519","SSH_ETA.lab","D9",5.0999999999999996,"not relevant","H+W",5.0999999999999996,5100]
[null,"Essve C-FT","countersunk","Essve Fullthread","1335740805000001","080x500/477","A0C 1A1 C1E","E","ESSVE C-FT  8,0 x 500/477","EG/KR+HSP/T40/YellWin500+ (SSH+Bit)",24.1,20.3,13.1,12.4,"",2790,950,25.8,8.6999999999999993,500,8,"8,0 x 500",477,15,90,null,"TX 40","RAPID® VOLLGEWINDE","Senkkopf, Unterkopfrippen",null,"EG-Vollgewinde, Halbspitze + Kernrippen","YellWin 500+",null,"ETA","ETA 12/0373",20,"LE005B","1359-CPD-0519","SSH_ETA.lab","D9",5.0999999999999996,"not relevant","H+W",5.0999999999999996,5100]
[null,"Essve C-FT","countersunk","Essve Fullthread","1335740806000001","080x600/577","A0C 1A1 C1E","E","ESSVE C-FT  8,0 x 600/577","EG/KR+HSP/T40/YellWin500+ (SSH+Bit)",24.1,20.3,13.1,12.4,"",2790,950,25.8,8.6999999999999993,600,8,"8,0 x 600",577,15,90,null,"TX 40","RAPID® VOLLGEWINDE","Senkkopf, Unterkopfrippen",null,"EG-Vollgewinde, Halbspitze + Kernrippen","YellWin 500+",null,"ETA","ETA 12/0373",20,"LE005B","1359-CPD-0519","SSH_ETA.lab","D9",5.0999999999999996,"not relevant","H+W",5.0999999999999996,5100]
[null,"Essve C-FT","countersunk","Essve Fullthread","1335741001200001","100x120/108","A0C 1A1 C1E","E","ESSVE C-FT  10,0 x 120/108","EG/KR+HSP/T50/YellWin500+ (SSH+Bit)",40,36.700000000000003,12.5,12.2,"",4175.45,950,55,15.6,120,10,"10,0 x 120",108,18.5,90,null,"TX 50","RAPID® VOLLGEWINDE","Senkkopf, Unterkopfrippen",null,"EG-Vollgewinde, Halbspitze + Kernrippen","YellWin 500+","Z-9.1-656","ETA","ETA 12/0373",20,"LE005B","1359-CPD-0519","SSH_ETA.lab","D8",6.2,"not relevant","H+W",6.2,6200]
[null,"Essve C-FT","countersunk","Essve Fullthread","1335741001600001","100x160/148","A0C 1A1 C1E","E","ESSVE C-FT  10,0 x 160/148","EG/KR+HSP/T50/YellWin500+ (SSH+Bit)",40,36.700000000000003,12.5,12.2,"",4175.45,950,55,15.6,160,10,"10,0 x 160",148,18.5,90,null,"TX 50","RAPID® VOLLGEWINDE","Senkkopf, Unterkopfrippen",null,"EG-Vollgewinde, Halbspitze + Kernrippen","YellWin 500+","Z-9.1-656","ETA","ETA 12/0373",20,"LE005B","1359-CPD-0519","SSH_ETA.lab","D8",6.2,"not relevant","H+W",6.2,6200]
[null,"Essve C-FT","countersunk","Essve Fullthread","1335741001800001","100x180/168","A0C 1A1 C1E","E","ESSVE C-FT  10,0 x 180/168","EG/KR+HSP/T50/YellWin500+ (SSH+Bit)",40,36.700000000000003,12.5,12.2,"",4175.45,950,55,15.6,180,10,"10,0 x 180",168,18.5,90,null,"TX 50","RAPID® VOLLGEWINDE","Senkkopf, Unterkopfrippen",null,"EG-Vollgewinde, Halbspitze + Kernrippen","YellWin 500+","Z-9.1-656, Z-9.1-509","ETA","ETA 12/0373",20,"LE005B","1359-CPD-0519","SSH_ETA.lab","D8",6.2,"not relevant","H+W",6.2,6200]
[null,"Essve C-FT","countersunk","Essve Fullthread","1335741002000001","100x200/188","A0C 1A1 C1E","E","ESSVE C-FT  10,0 x 200/188","EG/KR+HSP/T50/YellWin500+ (SSH+Bit)",40,36.700000000000003,12.5,12.2,"",4175.45,950,55,15.6,200,10,"10,0 x 200",188,18.5,90,null,"TX 50","RAPID® VOLLGEWINDE","Senkkopf, Unterkopfrippen",null,"EG-Vollgewinde, Halbspitze + Kernrippen","YellWin 500+","Z-9.1-656, Z-9.1-509","ETA","ETA 12/0373",20,"LE005B","1359-CPD-0519","SSH_ETA.lab","D8",6.2,"not relevant","H+W",6.2,6200]
[null,"Essve C-FT","countersunk","Essve Fullthread","1335741002200001","100x220/208","A0C 1A1 C1E","E","ESSVE C-FT  10,0 x 220/208","EG/KR+HSP/T50/YellWin500+ (SSH+Bit)",40,36.700000000000003,12.5,12.2,"",4175.45,950,55,15.6,220,10,"10,0 x 220",208,18.5,90,null,"TX 50","RAPID® VOLLGEWINDE","Senkkopf, Unterkopfrippen",null,"EG-Vollgewinde, Halbspitze + Kernrippen","YellWin 500+","Z-9.1-656, Z-9.1-509","ETA","ETA 12/0373",20,"LE005B","1359-CPD-0519","SSH_ETA.lab","D8",6.2,"not relevant","H+W",6.2,6200]
[null,"Essve C-FT","countersunk","Essve Fullthread","1335741002400001","100x240/228","A0C 1A1 C1E","E","ESSVE C-FT  10,0 x 240/228","EG/KR+HSP/T50/YellWin500+ (SSH+Bit)",40,36.700000000000003,12.5,12.2,"",4175.45,950,55,15.6,240,10,"10,0 x 240",228,18.5,90,null,"TX 50","RAPID® VOLLGEWINDE","Senkkopf, Unterkopfrippen",null,"EG-Vollgewinde, Halbspitze + Kernrippen","YellWin 500+","Z-9.1-656, Z-9.1-509","ETA","ETA 12/0373",20,"LE005B","1359-CPD-0519","SSH_ETA.lab","D8",6.2,"not relevant","H+W",6.2,6200]
[null,"Essve C-FT","countersunk","Essve Fullthread","1335741002600001","100x260/248","A0C 1A1 C1E","E","ESSVE C-FT  10,0 x 260/248","EG/KR+HSP/T50/YellWin500+ (SSH+Bit)",40,36.700000000000003,12.5,12.2,"",4175.45,950,55,15.6,260,10,"10,0 x 260",248,18.5,90,null,"TX 50","RAPID® VOLLGEWINDE","Senkkopf, Unterkopfrippen",null,"EG-Vollgewinde, Halbspitze + Kernrippen","YellWin 500+","Z-9.1-656, Z-9.1-509","ETA","ETA 12/0373",20,"LE005B","1359-CPD-0519","SSH_ETA.lab","D8",6.2,"not relevant","H+W",6.2,6200]
[null,"Essve C-FT","countersunk","Essve Fullthread","1335741002800001","100x280/268","A0C 1A1 C1E","E","ESSVE C-FT  10,0 x 280/268","EG/KR+HSP/T50/YellWin500+ (SSH+Bit)",40,36.700000000000003,12.5,12.2,"",4175.45,950,55,15.6,280,10,"10,0 x 280",268,18.5,90,null,"TX 50","RAPID® VOLLGEWINDE","Senkkopf, Unterkopfrippen",null,"EG-Vollgewinde, Halbspitze + Kernrippen","YellWin 500+","Z-9.1-656, Z-9.1-509","ETA","ETA 12/0373",20,"LE005B","1359-CPD-0519","SSH_ETA.lab","D8",6.2,"not relevant","H+W",6.2,6200]
[null,"Essve C-FT","countersunk","Essve Fullthread","1335741003000001","100x300/288","A0C 1A1 C1E","E","ESSVE C-FT  10,0 x 300/288","EG/KR+HSP/T50/YellWin500+ (SSH+Bit)",40,36.700000000000003,12.5,12.2,"",4175.45,950,55,15.6,300,10,"10,0 x 300",288,18.5,90,null,"TX 50","RAPID® VOLLGEWINDE","Senkkopf, Unterkopfrippen",null,"EG-Vollgewinde, Halbspitze + Kernrippen","YellWin 500+","Z-9.1-656, Z-9.1-509","ETA","ETA 12/0373",20,"LE005B","1359-CPD-0519","SSH_ETA.lab","D8",6.2,"not relevant","H+W",6.2,6200]
[null,"Essve C-FT","countersunk","Essve Fullthread","1335741003250001",null,null,null,"ESSVE C-FT  10,0 x 325/301","EG/KR+HSP/T50/YellWin500+ (SSH+Bit)",40,36.700000000000003,12.5,12.2,"",4175.45,950,55,15.6,325,10,"10,0 x 325",301,18.5,90,null,"TX 50","RAPID® VOLLGEWINDE","Senkkopf, Unterkopfrippen",null,"EG-Vollgewinde, Halbspitze + Kernrippen","YellWin 500+",null,"ETA","ETA 12/0373",20,"LE005B","1359-CPD-0519",null,null,6.2,"not relevant","H+W",6.2,6200]
[null,"Essve C-FT","countersunk","Essve Fullthread","1335741003500001","100x350/338","A0C 1A1 C1E","E","ESSVE C-FT  10,0 x 350/326","EG/KR+HSP/T50/YellWin500+ (SSH+Bit)",40,36.700000000000003,12.5,12.2,"",4175.45,950,55,15.6,350,10,"10,0 x 350",326,18.5,90,null,"TX 50","RAPID® VOLLGEWINDE","Senkkopf, Unterkopfrippen",null,"EG-Vollgewinde, Halbspitze + Kernrippen","YellWin 500+","Z-9.1-656, Z-9.1-509","ETA","ETA 12/0373",20,"LE005B","1359-CPD-0519","SSH_ETA.lab","D8",6.2,"not relevant","H+W",6.2,6200]
[null,"Essve C-FT","countersunk","Essve Fullthread","1335741003750001",null,null,null,"ESSVE C-FT  10,0 x 375/351","EG/KR+HSP/T50/YellWin500+ (SSH+Bit)",40,36.700000000000003,12.5,12.2,"",4175.45,950,55,15.6,375,10,"10,0 x 375",351,18.5,90,null,"TX 50","RAPID® VOLLGEWINDE","Senkkopf, Unterkopfrippen",null,"EG-Vollgewinde, Halbspitze + Kernrippen","YellWin 500+",null,"ETA","ETA 12/0373",20,"LE005B","1359-CPD-0519",null,null,6.2,"not relevant","H+W",6.2,6200]
[null,"Essve C-FT","countersunk","Essve Fullthread","1335741004000001","100x400/376","A0C 1A1 C1E","E","ESSVE C-FT  10,0 x 400/376","EG/KR+HSP/T50/YellWin500+ (SSH+Bit)",40,36.700000000000003,12.5,12.2,"",4175.45,950,55,15.6,400,10,"10,0 x 400",376,18.5,90,null,"TX 50","RAPID® VOLLGEWINDE","Senkkopf, Unterkopfrippen",null,"EG-Vollgewinde, Halbspitze + Kernrippen","YellWin 500+","Z-9.1-656, Z-9.1-509","ETA","ETA 12/0373",20,"LE005B","1359-CPD-0519","SSH_ETA.lab","D8",6.2,"not relevant","H+W",6.2,6200]
[null,"Essve C-FT","countersunk","Essve Fullthread","1335741004500001","100x450/426 ","A0C 1A1 C1E","E","ESSVE C-FT  10,0 x 450/426","EG/KR+HSP/T50/YellWin500+ (SSH+Bit)",40,36.700000000000003,12.5,12.2,"",4175.45,950,55,15.6,450,10,"10,0 x 450",426,18.5,90,null,"TX 50","RAPID® VOLLGEWINDE","Senkkopf, Unterkopfrippen",null,"EG-Vollgewinde, Halbspitze + Kernrippen","YellWin 500+","Z-9.1-656, Z-9.1-509","ETA","ETA 12/0373",20,"LE005B","1359-CPD-0519","SSH_ETA.lab","D9",6.2,"not relevant","H+W",6.2,6200]
[null,"Essve C-FT","countersunk","Essve Fullthread","1335741005000001","100x500/476","A0C 1A1 C1E","E","ESSVE C-FT  10,0 x 500/476","EG/KR+HSP/T50/YellWin500+ (SSH+Bit)",40,36.700000000000003,12.5,12.2,"",4175.45,950,55,15.6,500,10,"10,0 x 500",476,18.5,90,null,"TX 50","RAPID® VOLLGEWINDE","Senkkopf, Unterkopfrippen",null,"EG-Vollgewinde, Halbspitze + Kernrippen","YellWin 500+",null,"ETA","ETA 12/0373",20,"LE005B","1359-CPD-0519","SSH_ETA.lab","D9",6.2,"not relevant","H+W",6.2,6200]
[null,"Essve C-FT","countersunk","Essve Fullthread","1335741006000001","100x600/576","A0C 1A1 C1E","E","ESSVE C-FT  10,0 x 600/576","EG/KR+HSP/T50/YellWin500+ (SSH+Bit)",40,36.700000000000003,12.5,12.2,"",4175.45,950,55,15.6,600,10,"10,0 x 600",576,18.5,90,null,"TX 50","RAPID® VOLLGEWINDE","Senkkopf, Unterkopfrippen",null,"EG-Vollgewinde, Halbspitze + Kernrippen","YellWin 500+",null,"ETA","ETA 12/0373",20,"LE005B","1359-CPD-0519","SSH_ETA.lab","D9",6.2,"not relevant","H+W",6.2,6200]
[null,"Essve C-FT","countersunk","Essve Fullthread","1335741007000001",null,null,null,"ESSVE C-FT  10,0 x 700/676","EG/KR+HSP/T50/YellWin500+ (SSH+Bit)",40,36.700000000000003,12.5,12.2,"",4175.45,950,55,15.6,700,10,"10,0 x 700",676,18.5,90,null,"TX 50","RAPID® VOLLGEWINDE","Senkkopf, Unterkopfrippen",null,"EG-Vollgewinde, Halbspitze + Kernrippen","YellWin 500+",null,"ETA","ETA 12/0373",20,"LE005B","1359-CPD-0519",null,null,6.2,"not relevant","H+W",6.2,6200]
[null,"Essve C-FT","countersunk","Essve Fullthread","1335741008000001",null,null,null,"ESSVE C-FT  10,0 x 800/776","EG/KR+HSP/T50/YellWin500+ (SSH+Bit)",40,36.700000000000003,12.5,12.2,"",4175.45,950,55,15.6,800,10,"10,0 x 800",776,18.5,90,null,"TX 50","RAPID® VOLLGEWINDE","Senkkopf, Unterkopfrippen",null,"EG-Vollgewinde, Halbspitze + Kernrippen","YellWin 500+",null,"ETA","ETA 12/0373",20,"LE005B","1359-CPD-0519",null,null,6.2,"not relevant","H+W",6.2,6200]
[null,"Essve C-FT","countersunk","Essve Fullthread","1335741009990001",null,null,null,"ESSVE C-FT  10,0 x 1000/976","EG/KR+HSP/T50/YellWin500+ (SSH+Bit)",40,36.700000000000003,12.5,12.2,"",4175.45,950,55,15.6,1000,10,"10,0 x 1000",976,18.5,90,null,"TX 50","RAPID® VOLLGEWINDE","Senkkopf, Unterkopfrippen",null,"EG-Vollgewinde, Halbspitze + Kernrippen","YellWin 500+",null,"ETA","ETA 12/0373",20,"LE005B","1359-CPD-0519",null,null,6.2,"not relevant","H+W",6.2,6200]
[null,"Essve C-FT","countersunk","Essve Fullthread","1335741202000001","120x200/180","C0C 1A1 C1E","E","ESSVE C-FT  12,0 x 200/180","EG/KR+HSP/T50/YellWin500+ (SSH+Bit)",46.7,48.5,11.2,11,"",4400,950,73,27.6,200,12,"12,0 x 200",180,20,90,null,"TX 50","RAPID® VOLLGEWINDE","Senkkopf, Unterkopfrippen",null,"EG-Vollgewinde, Halbspitze + Kernrippen","YellWin 500+",null,"ETA","ETA 12/0373",20,"LE005B","1359-CPD-0519","SSH_ETA.lab","D8",7,"not relevant","H+W",7,7000]
[null,"Essve C-FT","countersunk","Essve Fullthread","1335741202200001","120x220/200","C0C 1A1 C1E","E","ESSVE C-FT  12,0 x 220/200","EG/KR+HSP/T50/YellWin500+ (SSH+Bit)",46.7,48.5,11.2,11,"",4400,950,73,27.6,220,12,"12,0 x 220",200,20,90,null,"TX 50","RAPID® VOLLGEWINDE","Senkkopf, Unterkopfrippen",null,"EG-Vollgewinde, Halbspitze + Kernrippen","YellWin 500+",null,"ETA","ETA 12/0373",20,"LE005B","1359-CPD-0519","SSH_ETA.lab","D8",7,"not relevant","H+W",7,7000]
[null,"Essve C-FT","countersunk","Essve Fullthread","1335741202400001","120x240/220","C0C 1A1 C1E","E","ESSVE C-FT  12,0 x 240/220","EG/KR+HSP/T50/YellWin500+ (SSH+Bit)",46.7,48.5,11.2,11,"",4400,950,73,27.6,240,12,"12,0 x 240",220,20,90,null,"TX 50","RAPID® VOLLGEWINDE","Senkkopf, Unterkopfrippen",null,"EG-Vollgewinde, Halbspitze + Kernrippen","YellWin 500+",null,"ETA","ETA 12/0373",20,"LE005B","1359-CPD-0519","SSH_ETA.lab","D8",7,"not relevant","H+W",7,7000]
[null,"Essve C-FT","countersunk","Essve Fullthread","1335741202600001","120x260/240","C0C 1A1 C1E","E","ESSVE C-FT  12,0 x 260/240","EG/KR+HSP/T50/YellWin500+ (SSH+Bit)",46.7,48.5,11.2,11,"",4400,950,73,27.6,260,12,"12,0 x 260",240,20,90,null,"TX 50","RAPID® VOLLGEWINDE","Senkkopf, Unterkopfrippen",null,"EG-Vollgewinde, Halbspitze + Kernrippen","YellWin 500+",null,"ETA","ETA 12/0373",20,"LE005B","1359-CPD-0519","SSH_ETA.lab","D8",7,"not relevant","H+W",7,7000]
[null,"Essve C-FT","countersunk","Essve Fullthread","1335741202800001","120x280/260","C0C 1A1 C1E","E","ESSVE C-FT  12,0 x 280/260","EG/KR+HSP/T50/YellWin500+ (SSH+Bit)",46.7,48.5,11.2,11,"",4400,950,73,27.6,280,12,"12,0 x 280",260,20,90,null,"TX 50","RAPID® VOLLGEWINDE","Senkkopf, Unterkopfrippen",null,"EG-Vollgewinde, Halbspitze + Kernrippen","YellWin 500+",null,"ETA","ETA 12/0373",20,"LE005B","1359-CPD-0519","SSH_ETA.lab","D8",7,"not relevant","H+W",7,7000]
[null,"Essve C-FT","countersunk","Essve Fullthread","1335741203000001","120x300/280","C0C 1A1 C1E","E","ESSVE C-FT  12,0 x 300/280","EG/KR+HSP/T50/YellWin500+ (SSH+Bit)",46.7,48.5,11.2,11,"",4400,950,73,27.6,300,12,"12,0 x 300",280,20,90,null,"TX 50","RAPID® VOLLGEWINDE","Senkkopf, Unterkopfrippen",null,"EG-Vollgewinde, Halbspitze + Kernrippen","YellWin 500+",null,"ETA","ETA 12/0373",20,"LE005B","1359-CPD-0519","SSH_ETA.lab","D8",7,"not relevant","H+W",7,7000]
[null,"Essve C-FT","countersunk","Essve Fullthread","1335741203500001","120x350/330","C0C 1A1 C1E","E","ESSVE C-FT  12,0 x 350/330","EG/KR+HSP/T50/YellWin500+ (SSH+Bit)",46.7,48.5,11.2,11,"",4400,950,73,27.6,350,12,"12,0 x 350",330,20,90,null,"TX 50","RAPID® VOLLGEWINDE","Senkkopf, Unterkopfrippen",null,"EG-Vollgewinde, Halbspitze + Kernrippen","YellWin 500+",null,"ETA","ETA 12/0373",20,"LE005B","1359-CPD-0519","SSH_ETA.lab","D8",7,"not relevant","H+W",7,7000]
[null,"Essve C-FT","countersunk","Essve Fullthread","1335741204000001","120x400/380","C0C 1A1 C1E","E","ESSVE C-FT  12,0 x 400/380","EG/KR+HSP/T50/YellWin500+ (SSH+Bit)",46.7,48.5,11.2,11,"",4400,950,73,27.6,400,12,"12,0 x 400",380,20,90,null,"TX 50","RAPID® VOLLGEWINDE","Senkkopf, Unterkopfrippen",null,"EG-Vollgewinde, Halbspitze + Kernrippen","YellWin 500+",null,"ETA","ETA 12/0373",20,"LE005B","1359-CPD-0519","SSH_ETA.lab","D8",7,"not relevant","H+W",7,7000]
[null,"Essve C-FT","countersunk","Essve Fullthread","1335741205000001","120x500/480","C0C 1A1 C1E","E","ESSVE C-FT  12,0 x 500/480","EG/KR+HSP/T50/YellWin500+ (SSH+Bit)",46.7,48.5,11.2,11,"",4400,950,73,27.6,500,12,"12,0 x 500",480,20,90,null,"TX 50","RAPID® VOLLGEWINDE","Senkkopf, Unterkopfrippen",null,"EG-Vollgewinde, Halbspitze + Kernrippen","YellWin 500+",null,"ETA","ETA 12/0373",20,"LE005B","1359-CPD-0519","SSH_ETA.lab","D8",7,"not relevant","H+W",7,7000]
[null,"Essve C-FT","countersunk","Essve Fullthread","1335741206000001","120x600/580","C0C 1A1 C1E","E","ESSVE C-FT  12,0 x 600/580","EG/KR+HSP/T50/YellWin500+ (SSH+Bit)",46.7,48.5,11.2,11,"",4400,950,73,27.6,600,12,"12,0 x 600",580,20,90,null,"TX 50","RAPID® VOLLGEWINDE","Senkkopf, Unterkopfrippen",null,"EG-Vollgewinde, Halbspitze + Kernrippen","YellWin 500+",null,"ETA","ETA 12/0373",20,"LE005B","1359-CPD-0519","SSH_ETA.lab","D8",7,"not relevant","H+W",7,7000]
[null,"Essve C-FT","countersunk","Essve Fullthread","1335741207000001",null,null,null,"ESSVE C-FT  12,0 x 700/680","EG/KR+HSP/T50/YellWin500+ (SSH+Bit)",46.7,48.5,11.2,11,"",4400,950,73,27.6,700,12,"12,0 x 700",680,20,90,null,"TX 50","RAPID® VOLLGEWINDE","Senkkopf, Unterkopfrippen",null,"EG-Vollgewinde, Halbspitze + Kernrippen","YellWin 500+",null,"ETA","ETA 12/0373",20,"LE005B","1359-CPD-0519",null,null,7,"not relevant","H+W",7,7000]
[null,"Essve C-FT","countersunk","Essve Fullthread","1335741208000001",null,null,null,"ESSVE C-FT  12,0 x 800/780","EG/KR+HSP/T50/YellWin500+ (SSH+Bit)",46.7,48.5,11.2,11,"",4400,950,73,27.6,800,12,"12,0 x 800",780,20,90,null,"TX 50","RAPID® VOLLGEWINDE","Senkkopf, Unterkopfrippen",null,"EG-Vollgewinde, Halbspitze + Kernrippen","YellWin 500+",null,"ETA","ETA 12/0373",20,"LE005B","1359-CPD-0519",null,null,7,"not relevant","H+W",7,7000]
[null,"Essve C-FT","countersunk","Essve Fullthread","1335741209990001",null,null,null,"ESSVE C-FT  12,0 x 1000/980","EG/KR+HSP/T50/YellWin500+ (SSH+Bit)",46.7,48.5,11.2,11,"",4400,950,73,27.6,1000,12,"12,0 x 1000",980,20,90,null,"TX 50","RAPID® VOLLGEWINDE","Senkkopf, Unterkopfrippen",null,"EG-Vollgewinde, Halbspitze + Kernrippen","YellWin 500+",null,"ETA","ETA 12/0373",20,"LE005B","1359-CPD-0519",null,null,7,"not relevant","H+W",7,7000]
["slst_1_5","Essve CY-FT","cylinder","Essve Fullthread","1331740801200001","080x120/110","L0L 1A1 A0E","E","ESSVE CY-FT  8,0X120/110","EG/KR/T40/YellWin500+ (SSH+Bit)",24.1,20.3,13.1,"0 (kein Kopfdurchzug)","",0,950,25.8,8.6999999999999993,120,8,"8,0 x 120",110,10.199999999999999,"kein kopfdurchzug",null,"TX 40","RAPID® VOLLGEWINDE","cylinderkopf",null,"EG-Vollgewinde + Kernrippen","YellWin 500+",null,"ETA","ETA 12/0373",20,"LE005B","1359-CPD-0519","SSH_ETA.lab","D10",5.0999999999999996,"not relevant","H+W",5.0999999999999996,5100]
[null,"Essve CY-FT","cylinder","Essve Fullthread","1331740801400001","080x140/130","L0L 1A1 A0E","E","ESSVE CY-FT  8,0X140/130","EG/KR/T40/YellWin500+ (SSH+Bit)",24.1,20.3,13.1,"1 (kein Kopfdurchzug)","",0,950,25.8,8.6999999999999993,140,8,"8,0 x 140",130,10.199999999999999,"kein kopfdurchzug",null,"TX 40","RAPID® VOLLGEWINDE","cylinderkopf",null,"EG-Vollgewinde + Kernrippen","YellWin 500+",null,"ETA","ETA 12/0373",20,"LE005B","1359-CPD-0519","SSH_ETA.lab","D10",5.0999999999999996,"not relevant","H+W",5.0999999999999996,5100]
[null,"Essve CY-FT","cylinder","Essve Fullthread","1331740801600001","080x160/150","L0L 1A1 A0E","E","ESSVE CY-FT  8,0X160/150","EG/KR/T40/YellWin500+ (SSH+Bit)",24.1,20.3,13.1,"2 (kein Kopfdurchzug)","",0,950,25.8,8.6999999999999993,160,8,"8,0 x 160",150,10.199999999999999,"kein kopfdurchzug",null,"TX 40","RAPID® VOLLGEWINDE","cylinderkopf",null,"EG-Vollgewinde + Kernrippen","YellWin 500+",null,"ETA","ETA 12/0373",20,"LE005B","1359-CPD-0519","SSH_ETA.lab","D10",5.0999999999999996,"not relevant","H+W",5.0999999999999996,5100]
[null,"Essve CY-FT","cylinder","Essve Fullthread","1331740801800001","080x180/170","L0L 1A1 A0E","E","ESSVE CY-FT  8,0X180/170","EG/KR/T40/YellWin500+ (SSH+Bit)",24.1,20.3,13.1,"3 (kein Kopfdurchzug)","",0,950,25.8,8.6999999999999993,180,8,"8,0 x 180",170,10.199999999999999,"kein kopfdurchzug",null,"TX 40","RAPID® VOLLGEWINDE","cylinderkopf",null,"EG-Vollgewinde + Kernrippen","YellWin 500+",null,"ETA","ETA 12/0373",20,"LE005B","1359-CPD-0519","SSH_ETA.lab","D10",5.0999999999999996,"not relevant","H+W",5.0999999999999996,5100]
[null,"Essve CY-FT","cylinder","Essve Fullthread","1331740802000001","080x200/190","L0L 1A1 A0E","E","ESSVE CY-FT  8,0X200/190","EG/KR/T40/YellWin500+ (SSH+Bit)",24.1,20.3,13.1,"4 (kein Kopfdurchzug)","",0,950,25.8,8.6999999999999993,200,8,"8,0 x 200",190,10.199999999999999,"kein kopfdurchzug",null,"TX 40","RAPID® VOLLGEWINDE","cylinderkopf",null,"EG-Vollgewinde + Kernrippen","YellWin 500+",null,"ETA","ETA 12/0373",20,"LE005B","1359-CPD-0519","SSH_ETA.lab","D10",5.0999999999999996,"not relevant","H+W",5.0999999999999996,5100]
[null,"Essve CY-FT","cylinder","Essve Fullthread","1331740802200001","080x220/210","L0L 1A1 A0E","E","ESSVE CY-FT  8,0X220/210","EG/KR/T40/YellWin500+ (SSH+Bit)",24.1,20.3,13.1,"5 (kein Kopfdurchzug)","",0,950,25.8,8.6999999999999993,220,8,"8,0 x 220",210,10.199999999999999,"kein kopfdurchzug",null,"TX 40","RAPID® VOLLGEWINDE","cylinderkopf",null,"EG-Vollgewinde + Kernrippen","YellWin 500+",null,"ETA","ETA 12/0373",20,"LE005B","1359-CPD-0519","SSH_ETA.lab","D10",5.0999999999999996,"not relevant","H+W",5.0999999999999996,5100]
[null,"Essve CY-FT","cylinder","Essve Fullthread","1331740802400001","080x240/230","L0L 1A1 A0E","E","ESSVE CY-FT  8,0X240/230","EG/KR/T40/YellWin500+ (SSH+Bit)",24.1,20.3,13.1,"6 (kein Kopfdurchzug)","",0,950,25.8,8.6999999999999993,240,8,"8,0 x 240",230,10.199999999999999,"kein kopfdurchzug",null,"TX 40","RAPID® VOLLGEWINDE","cylinderkopf",null,"EG-Vollgewinde + Kernrippen","YellWin 500+",null,"ETA","ETA 12/0373",20,"LE005B","1359-CPD-0519","SSH_ETA.lab","D10",5.0999999999999996,"not relevant","H+W",5.0999999999999996,5100]
[null,"Essve CY-FT","cylinder","Essve Fullthread","1331740802600001","080x260/250","L0L 1A1 A0E","E","ESSVE CY-FT  8,0X260/250","EG/KR/T40/YellWin500+ (SSH+Bit)",24.1,20.3,13.1,"7 (kein Kopfdurchzug)","",0,950,25.8,8.6999999999999993,260,8,"8,0 x 260",250,10.199999999999999,"kein kopfdurchzug",null,"TX 40","RAPID® VOLLGEWINDE","cylinderkopf",null,"EG-Vollgewinde + Kernrippen","YellWin 500+",null,"ETA","ETA 12/0373",20,"LE005B","1359-CPD-0519","SSH_ETA.lab","D10",5.0999999999999996,"not relevant","H+W",5.0999999999999996,5100]
[null,"Essve CY-FT","cylinder","Essve Fullthread","1331740802800001","080x280/270","L0L 1A1 A0E","E","ESSVE CY-FT  8,0X280/270","EG/KR/T40/YellWin500+ (SSH+Bit)",24.1,20.3,13.1,"8 (kein Kopfdurchzug)","",0,950,25.8,8.6999999999999993,280,8,"8,0 x 280",270,10.199999999999999,"kein kopfdurchzug",null,"TX 40","RAPID® VOLLGEWINDE","cylinderkopf",null,"EG-Vollgewinde + Kernrippen","YellWin 500+",null,"ETA","ETA 12/0373",20,"LE005B","1359-CPD-0519","SSH_ETA.lab","D10",5.0999999999999996,"not relevant","H+W",5.0999999999999996,5100]
[null,"Essve CY-FT","cylinder","Essve Fullthread","1331740803000001","080x300/290","L0L 1A1 A0E","E","ESSVE CY-FT  8,0X300/290","EG/KR/T40/YellWin500+ (SSH+Bit)",24.1,20.3,13.1,"9 (kein Kopfdurchzug)","",0,950,25.8,8.6999999999999993,300,8,"8,0 x 300",290,10.199999999999999,"kein kopfdurchzug",null,"TX 40","RAPID® VOLLGEWINDE","cylinderkopf",null,"EG-Vollgewinde + Kernrippen","YellWin 500+",null,"ETA","ETA 12/0373",20,"LE005B","1359-CPD-0519","SSH_ETA.lab","D10",5.0999999999999996,"not relevant","H+W",5.0999999999999996,5100]
[null,"Essve CY-FT","cylinder","Essve Fullthread","1331740803250001",null,null,null,"ESSVE CY-FT  8,0X325/315","EG/KR/T40/YellWin500+ (SSH+Bit)",24.1,20.3,13.1,"10 (kein Kopfdurchzug)","",0,950,25.8,8.6999999999999993,325,8,"8,0 x 325",315,10.199999999999999,"kein kopfdurchzug",null,"TX 40","RAPID® VOLLGEWINDE","cylinderkopf",null,"EG-Vollgewinde + Kernrippen","YellWin 500+",null,"ETA","ETA 12/0373",20,"LE005B","1359-CPD-0519",null,null,5.0999999999999996,"not relevant","H+W",5.0999999999999996,5100]
[null,"Essve CY-FT","cylinder","Essve Fullthread","1331740803500001","080x350/340","L0L 1A1 A0E","E","ESSVE CY-FT  8,0X350/340","EG/KR/T40/YellWin500+ (SSH+Bit)",24.1,20.3,13.1,"11 (kein Kopfdurchzug)","",0,950,25.8,8.6999999999999993,350,8,"8,0 x 350",340,10.199999999999999,"kein kopfdurchzug",null,"TX 40","RAPID® VOLLGEWINDE","cylinderkopf",null,"EG-Vollgewinde + Kernrippen","YellWin 500+",null,"ETA","ETA 12/0373",20,"LE005B","1359-CPD-0519","SSH_ETA.lab","D10",5.0999999999999996,"not relevant","H+W",5.0999999999999996,5100]
[null,"Essve CY-FT","cylinder","Essve Fullthread","1331740803750001",null,null,null,"ESSVE CY-FT  8,0X375/365","EG/KR/T40/YellWin500+ (SSH+Bit)",24.1,20.3,13.1,"12 (kein Kopfdurchzug)","",0,950,25.8,8.6999999999999993,375,8,"8,0 x 375",365,10.199999999999999,"kein kopfdurchzug",null,"TX 40","RAPID® VOLLGEWINDE","cylinderkopf",null,"EG-Vollgewinde + Kernrippen","YellWin 500+",null,"ETA","ETA 12/0373",20,"LE005B","1359-CPD-0519",null,null,5.0999999999999996,"not relevant","H+W",5.0999999999999996,5100]
[null,"Essve CY-FT","cylinder","Essve Fullthread","1331740804000001","080x400/390","L0L 1A1 A0E","E","ESSVE CY-FT  8,0X400/390","EG/KR/T40/YellWin500+ (SSH+Bit)",24.1,20.3,13.1,"13 (kein Kopfdurchzug)","",0,950,25.8,8.6999999999999993,400,8,"8,0 x 400",390,10.199999999999999,"kein kopfdurchzug",null,"TX 40","RAPID® VOLLGEWINDE","cylinderkopf",null,"EG-Vollgewinde + Kernrippen","YellWin 500+",null,"ETA","ETA 12/0373",20,"LE005B","1359-CPD-0519","SSH_ETA.lab","D10",5.0999999999999996,"not relevant","H+W",5.0999999999999996,5100]
[null,"Essve CY-FT","cylinder","Essve Fullthread","1331740804500001","080x450/428","L0L 1A1 C0E","E","ESSVE CY-FT  8,0 x 450/427","EG/KR+HSP/T40/YellWin500+ (SSH+Bit)",24.1,20.3,13.1,"14 (kein Kopfdurchzug)","",0,950,25.8,8.6999999999999993,450,8,"8,0 x 450",427,10.199999999999999,"kein kopfdurchzug",null,"TX 40","RAPID® VOLLGEWINDE","cylinderkopf",null,"EG-Vollgewinde, Halbspitze + Kernrippen","YellWin 500+",null,"ETA","ETA 12/0373",20,"LE005B","1359-CPD-0519","SSH_ETA.lab","D9",5.0999999999999996,"not relevant","H+W",5.0999999999999996,5100]
[null,"Essve CY-FT","cylinder","Essve Fullthread","1331740805000001","080x500/478 ","L0L 1A1 C0E","E","ESSVE CY-FT  8,0 x 500/477","EG/KR+HSP/T40/YellWin500+ (SSH+Bit)",24.1,20.3,13.1,"15 (kein Kopfdurchzug)","",0,950,25.8,8.6999999999999993,500,8,"8,0 x 500",477,10.199999999999999,"kein kopfdurchzug",null,"TX 40","RAPID® VOLLGEWINDE","cylinderkopf",null,"EG-Vollgewinde, Halbspitze + Kernrippen","YellWin 500+",null,"ETA","ETA 12/0373",20,"LE005B","1359-CPD-0519","SSH_ETA.lab","D9",5.0999999999999996,"not relevant","H+W",5.0999999999999996,5100]
[null,"Essve CY-FT","cylinder","Essve Fullthread","1331740806000001","080x600/578","L0L 1A1 C0E","E","ESSVE CY-FT  8,0 x 600/577","EG/KR+HSP/T40/YellWin500+ (SSH+Bit)",24.1,20.3,13.1,"16 (kein Kopfdurchzug)","",0,950,25.8,8.6999999999999993,600,8,"8,0 x 600",577,10.199999999999999,"kein kopfdurchzug",null,"TX 40","RAPID® VOLLGEWINDE","cylinderkopf",null,"EG-Vollgewinde, Halbspitze + Kernrippen","YellWin 500+",null,"ETA","ETA 12/0373",20,"LE005B","1359-CPD-0519","SSH_ETA.lab","D9",5.0999999999999996,"not relevant","H+W",5.0999999999999996,5100]
[null,"Essve CY-FT","cylinder","Essve Fullthread","1331741002000001",null,null,null,"ESSVE CY-FT  10,0 x 200/188","EG/KR+HSP/T50/YellWin500+ (SSH+Bit)",40,36.700000000000003,12.5,"17 (kein Kopfdurchzug)","",0,950,55,15.6,200,10,"10,0 x 200",188,13.4,"kein kopfdurchzug",null,"TX 50","RAPID® VOLLGEWINDE","cylinderkopf",null,"EG-Vollgewinde, Halbspitze + Kernrippen","YellWin 500+",null,"ETA","ETA 12/0373",20,"LE005B","1359-CPD-0519",null,null,6.2,"not relevant","H+W",6.2,6200]
[null,"Essve CY-FT","cylinder","Essve Fullthread","1331741002400001",null,null,null,"ESSVE CY-FT  10,0 x 240/228","EG/KR+HSP/T50/YellWin500+ (SSH+Bit)",40,36.700000000000003,12.5,"18 (kein Kopfdurchzug)","",0,950,55,15.6,240,10,"10,0 x 240",228,13.4,"kein kopfdurchzug",null,"TX 50","RAPID® VOLLGEWINDE","cylinderkopf",null,"EG-Vollgewinde, Halbspitze + Kernrippen","YellWin 500+",null,"ETA","ETA 12/0373",20,"LE005B","1359-CPD-0519",null,null,6.2,"not relevant","H+W",6.2,6200]
[null,"Essve CY-FT","cylinder","Essve Fullthread","1331741002600001",null,null,null,"ESSVE CY-FT  10,0 x 260/248","EG/KR+HSP/T50/YellWin500+ (SSH+Bit)",40,36.700000000000003,12.5,"19 (kein Kopfdurchzug)","",0,950,55,15.6,260,10,"10,0 x 260",248,13.4,"kein kopfdurchzug",null,"TX 50","RAPID® VOLLGEWINDE","cylinderkopf",null,"EG-Vollgewinde, Halbspitze + Kernrippen","YellWin 500+",null,"ETA","ETA 12/0373",20,"LE005B","1359-CPD-0519",null,null,6.2,"not relevant","H+W",6.2,6200]
[null,"Essve CY-FT","cylinder","Essve Fullthread","1331741002800001",null,null,null,"ESSVE CY-FT  10,0 x 280/268","EG/KR+HSP/T50/YellWin500+ (SSH+Bit)",40,36.700000000000003,12.5,"20 (kein Kopfdurchzug)","",0,950,55,15.6,280,10,"10,0 x 280",268,13.4,"kein kopfdurchzug",null,"TX 50","RAPID® VOLLGEWINDE","cylinderkopf",null,"EG-Vollgewinde, Halbspitze + Kernrippen","YellWin 500+",null,"ETA","ETA 12/0373",20,"LE005B","1359-CPD-0519",null,null,6.2,"not relevant","H+W",6.2,6200]
[null,"Essve CY-FT","cylinder","Essve Fullthread","1331741003000001",null,null,null,"ESSVE CY-FT  10,0 x 300/288","EG/KR+HSP/T50/YellWin500+ (SSH+Bit)",40,36.700000000000003,12.5,"21 (kein Kopfdurchzug)","",0,950,55,15.6,300,10,"10,0 x 300",288,13.4,"kein kopfdurchzug",null,"TX 50","RAPID® VOLLGEWINDE","cylinderkopf",null,"EG-Vollgewinde, Halbspitze + Kernrippen","YellWin 500+",null,"ETA","ETA 12/0373",20,"LE005B","1359-CPD-0519",null,null,6.2,"not relevant","H+W",6.2,6200]
[null,"Essve CY-FT","cylinder","Essve Fullthread","1331741003250001",null,null,null,"ESSVE CY-FT  10,0 x 325/301","EG/KR+HSP/T50/YellWin500+ (SSH+Bit)",40,36.700000000000003,12.5,"22 (kein Kopfdurchzug)","",0,950,55,15.6,325,10,"10,0 x 325",301,13.4,"kein kopfdurchzug",null,"TX 50","RAPID® VOLLGEWINDE","cylinderkopf",null,"EG-Vollgewinde, Halbspitze + Kernrippen","YellWin 500+",null,"ETA","ETA 12/0373",20,"LE005B","1359-CPD-0519",null,null,6.2,"not relevant","H+W",6.2,6200]
[null,"Essve CY-FT","cylinder","Essve Fullthread","1331741003500001",null,null,null,"ESSVE CY-FT  10,0 x 350/326","EG/KR+HSP/T50/YellWin500+ (SSH+Bit)",40,36.700000000000003,12.5,"23 (kein Kopfdurchzug)",{"$f":"IF(C205=\"Scheibe\",N205*0.6,\"\")","v":""},0,950,55,15.6,350,10,"10,0 x 350",326,13.4,"kein kopfdurchzug",null,"TX 50","RAPID® VOLLGEWINDE","cylinderkopf",null,"EG-Vollgewinde, Halbspitze + Kernrippen","YellWin 500+",null,"ETA","ETA 12/0373",20,"LE005B","1359-CPD-0519",null,null,6.2,"not relevant","H+W",6.2,{"$f":"AR205*1000","v":6200}]
[null,"Essve CY-FT","cylinder","Essve Fullthread","1331741003750001",null,null,null,"ESSVE CY-FT  10,0 x 375/351","EG/KR+HSP/T50/YellWin500+ (SSH+Bit)",40,36.700000000000003,12.5,"24 (kein Kopfdurchzug)","",0,950,55,15.6,375,10,"10,0 x 375",351,13.4,"kein kopfdurchzug",null,"TX 50","RAPID® VOLLGEWINDE","cylinderkopf",null,"EG-Vollgewinde, Halbspitze + Kernrippen","YellWin 500+",null,"ETA","ETA 12/0373",20,"LE005B","1359-CPD-0519",null,null,6.2,"not relevant","H+W",6.2,6200]
[null,"Essve CY-FT","cylinder","Essve Fullthread","1331741004000001",null,null,null,"ESSVE CY-FT  10,0 x 400/376","EG/KR+HSP/T50/YellWin500+ (SSH+Bit)",40,36.700000000000003,12.5,"25 (kein Kopfdurchzug)","",0,950,55,15.6,400,10,"10,0 x 400",376,13.4,"kein kopfdurchzug",null,"TX 50","RAPID® VOLLGEWINDE","cylinderkopf",null,"EG-Vollgewinde, Halbspitze + Kernrippen","YellWin 500+",null,"ETA","ETA 12/0373",20,"LE005B","1359-CPD-0519",null,null,6.2,"not relevant","H+W",6.2,6200]
[null,"Essve CY-FT","cylinder","Essve Fullthread","1331741004500001","100x450/426 ","L0L 1A1 C0E","E","ESSVE CY-FT  10,0 x 450/426","EG/KR+HSP/T50/YellWin500+ (SSH+Bit)",40,36.700000000000003,12.5,"26 (kein Kopfdurchzug)","",0,950,55,15.6,450,10,"10,0 x 450",426,13.4,"kein kopfdurchzug",null,"TX 50","RAPID® VOLLGEWINDE","cylinderkopf",null,"EG-Vollgewinde, Halbspitze + Kernrippen","YellWin 500+",null,"ETA","ETA 12/0373",20,"LE005B","1359-CPD-0519","SSH_ETA.lab","D9",6.2,"not relevant","H+W",6.2,6200]
[null,"Essve CY-FT","cylinder","Essve Fullthread","1331741005000001","100x500/476","L0L 1A1 C0E","E","ESSVE CY-FT  10,0 x 500/476","EG/KR+HSP/T50/YellWin500+ (SSH+Bit)",40,36.700000000000003,12.5,"27 (kein Kopfdurchzug)","",0,950,55,15.6,500,10,"10,0 x 500",476,13.4,"kein kopfdurchzug",null,"TX 50","RAPID® VOLLGEWINDE","cylinderkopf",null,"EG-Vollgewinde, Halbspitze + Kernrippen","YellWin 500+",null,"ETA","ETA 12/0373",20,"LE005B","1359-CPD-0519","SSH_ETA.lab","D9",6.2,"not relevant","H+W",6.2,6200]
[null,"Essve CY-FT","cylinder","Essve Fullthread","1331741006000001","100x600/576","L0L 1A1 C0E","E","ESSVE CY-FT  10,0 x 600/576","EG/KR+HSP/T50/YellWin500+ (SSH+Bit)",40,36.700000000000003,12.5,"28 (kein Kopfdurchzug)","",0,950,55,15.6,600,10,"10,0 x 600",576,13.4,"kein kopfdurchzug",null,"TX 50","RAPID® VOLLGEWINDE","cylinderkopf",null,"EG-Vollgewinde, Halbspitze + Kernrippen","YellWin 500+",null,"ETA","ETA 12/0373",20,"LE005B","1359-CPD-0519","SSH_ETA.lab","D9",6.2,"not relevant","H+W",6.2,6200]
[null,"Essve CY-FT","cylinder","Essve Fullthread","1331741007000001",null,null,null,"ESSVE CY-FT  10,0 x 700/676","EG/KR+HSP/T50/YellWin500+ (SSH+Bit)",40,36.700000000000003,12.5,"29 (kein Kopfdurchzug)","",0,950,55,15.6,700,10,"10,0 x 700",676,13.4,"kein kopfdurchzug",null,"TX 50","RAPID® VOLLGEWINDE","cylinderkopf",null,"EG-Vollgewinde, Halbspitze + Kernrippen","YellWin 500+",null,"ETA","ETA 12/0373",20,"LE005B","1359-CPD-0519",null,null,6.2,"not relevant","H+W",6.2,6200]
[null,"Essve CY-FT","cylinder","Essve Fullthread","1331741008000001",null,null,null,"ESSVE CY-FT  10,0 x 800/776","EG/KR+HSP/T50/YellWin500+ (SSH+Bit)",40,36.700000000000003,12.5,"30 (kein Kopfdurchzug)","",0,950,55,15.6,800,10,"10,0 x 800",776,13.4,"kein kopfdurchzug",null,"TX 50","RAPID® VOLLGEWINDE","cylinderkopf",null,"EG-Vollgewinde, Halbspitze + Kernrippen","YellWin 500+",null,"ETA","ETA 12/0373",20,"LE005B","1359-CPD-0519",null,null,6.2,"not relevant","H+W",6.2,6200]
[null,"Essve CY-FT","cylinder","Essve Fullthread","1331741009990001",null,null,null,"ESSVE CY-FT  10,0 x 1000/976","EG/KR+HSP/T50/YellWin500+ (SSH+Bit)",40,36.700000000000003,12.5,"31 (kein Kopfdurchzug)","",0,950,55,15.6,1000,10,"10,0 x 1000",976,13.4,"kein kopfdurchzug",null,"TX 50","RAPID® VOLLGEWINDE","cylinderkopf",null,"EG-Vollgewinde, Halbspitze + Kernrippen","YellWin 500+",null,"ETA","ETA 12/0373",20,"LE005B","1359-CPD-0519",null,null,6.2,"not relevant","H+W",6.2,6200]
["slst_1_6","Essve CY-DT","cylinder","Essve double thrd.","5939710802400001","080x240/084+080","L1L 0B1 B0B","B","Essve CY-DT  8X240/80+R/80","T40/BLUEWIN (Essve-package)",22,22.6,10.7,"0 (kein Kopfdurchzug)","",0,900,24.8,8.3000000000000007,240,8,"8,0 x 240",227.5,10.199999999999999,"kein kopfdurchzug","+R","TX 40","RAPID® Top-2-Roof","cylinderkopf","Reibteil","GG-Teilgewinde, Unterkopfstützgewinde","BlueWin",null,"ETA","ETA 12/0373",20,"LE002B","1359-CPD-0519","SSH_ETA.lab","D12 neu",5.3,5.9,"H+W",5.3,5300]
[null,"Essve CY-DT","cylinder","Essve double thrd.","5939710802600001","080x260/100+080","L1L 0B1 B0B","B","Essve CY-DT  8X260/100+R/80","T40/BLUEWIN (Essve-package)",22,22.6,10.7,"1 (kein Kopfdurchzug)","",0,900,24.8,8.3000000000000007,260,8,"8,0 x 260",247.5,10.199999999999999,"kein kopfdurchzug","+R","TX 40","RAPID® Top-2-Roof","cylinderkopf","Reibteil","GG-Teilgewinde, Unterkopfstützgewinde","BlueWin",null,"ETA","ETA 12/0373",20,"LE002B","1359-CPD-0519","SSH_ETA.lab","D12 neu",5.3,5.9,"H+W",5.3,5300]
[null,"Essve CY-DT","cylinder","Essve double thrd.","5939710802800001","080x280/100+080","L1L 0B1 B0B","B","Essve CY-DT  8X280/100+R/80","T40/BLUEWIN (Essve-package)",22,22.6,10.7,"2 (kein Kopfdurchzug)","",0,900,24.8,8.3000000000000007,280,8,"8,0 x 280",267.5,10.199999999999999,"kein kopfdurchzug","+R","TX 40","RAPID® Top-2-Roof","cylinderkopf","Reibteil","GG-Teilgewinde, Unterkopfstützgewinde","BlueWin",null,"ETA","ETA 12/0373",20,"LE002B","1359-CPD-0519","SSH_ETA.lab","D12 neu",5.3,5.9,"H+W",5.3,5300]
[null,"Essve CY-DT","cylinder","Essve double thrd.","5939710803000001","080x300/100+080","L1L 0B1 B0B","B","Essve CY-DT  8X300/100+R/80","T40/BLUEWIN (Essve-package)",22,22.6,10.7,"3 (kein Kopfdurchzug)","",0,900,24.8,8.3000000000000007,300,8,"8,0 x 300",287.5,10.199999999999999,"kein kopfdurchzug","+R","TX 40","RAPID® Top-2-Roof","cylinderkopf","Reibteil","GG-Teilgewinde, Unterkopfstützgewinde","BlueWin",null,"ETA","ETA 12/0373",20,"LE002B","1359-CPD-0519","SSH_ETA.lab","D12 neu",5.3,5.9,"H+W",5.3,5300]
[null,"Essve CY-DT","cylinder","Essve double thrd.","5939710803200001","080x320/100+080","L1L 0B1 B0B","B","Essve CY-DT  8X320/100+R/80","T40/BLUEWIN (Essve-package)",22,22.6,10.7,"4 (kein Kopfdurchzug)","",0,900,24.8,8.3000000000000007,320,8,"8,0 x 320",307.5,10.199999999999999,"kein kopfdurchzug","+R","TX 40","RAPID® Top-2-Roof","cylinderkopf","Reibteil","GG-Teilgewinde, Unterkopfstützgewinde","BlueWin",null,"ETA","ETA 12/0373",20,"LE002B","1359-CPD-0519","SSH_ETA.lab","D12 neu",5.3,5.9,"H+W",5.3,5300]
[null,"Essve CY-DT","cylinder","Essve double thrd.","5939710803400001","080x340/100+080","L1L 0B1 B0B","B","Essve CY-DT  8X340/100+R/80","T40/BLUEWIN (Essve-package)",22,22.6,10.7,"5 (kein Kopfdurchzug)","",0,900,24.8,8.3000000000000007,340,8,"8,0 x 340",327.5,10.199999999999999,"kein kopfdurchzug","+R","TX 40","RAPID® Top-2-Roof","cylinderkopf","Reibteil","GG-Teilgewinde, Unterkopfstützgewinde","BlueWin",null,"ETA","ETA 12/0373",20,"LE002B","1359-CPD-0519","SSH_ETA.lab","D12 neu",5.3,5.9,"H+W",5.3,5300]
[null,"Essve CY-DT","cylinder","Essve double thrd.","5939710803600001","080x360/100+080","L1L 0B1 B0B","B","Essve CY-DT  8X360/100+R/80","T40/BLUEWIN (Essve-package)",22,22.6,10.7,"6 (kein Kopfdurchzug)","",0,900,24.8,8.3000000000000007,360,8,"8,0 x 360",347.5,10.199999999999999,"kein kopfdurchzug","+R","TX 40","RAPID® Top-2-Roof","cylinderkopf","Reibteil","GG-Teilgewinde, Unterkopfstützgewinde","BlueWin",null,"ETA","ETA 12/0373",20,"LE002B","1359-CPD-0519","SSH_ETA.lab","D12 neu",5.3,5.9,"H+W",5.3,5300]
[null,"Essve CY-DT","cylinder","Essve double thrd.","5939710804000001","080x400/100+080","L1L 0B1 B0B","B","Essve CY-DT  8X400/100+R/80","T40/BLUEWIN (Essve-package)",22,22.6,10.7,"7 (kein Kopfdurchzug)","",0,900,24.8,8.3000000000000007,400,8,"8,0 x 400",387.5,10.199999999999999,"kein kopfdurchzug","+R","TX 40","RAPID® Top-2-Roof","cylinderkopf","Reibteil","GG-Teilgewinde, Unterkopfstützgewinde","BlueWin",null,"ETA","ETA 12/0373",20,"LE002B","1359-CPD-0519","SSH_ETA.lab","D12 neu",5.3,5.9,"H+W",5.3,5300]
[null,"Essve CY-DT","cylinder","Essve double thrd.","5939710804500001","080x450/100+080","L1L 0B1 B0B","B","Essve CY-DT  8X450/100+R/80","T40/BLUEWIN (Essve-package)",22,22.6,10.7,"8 (kein Kopfdurchzug)","",0,900,24.8,8.3000000000000007,450,8,"8,0 x 450",437.5,10.199999999999999,"kein kopfdurchzug","+R","TX 40","RAPID® Top-2-Roof","cylinderkopf","Reibteil","GG-Teilgewinde, Unterkopfstützgewinde","BlueWin",null,"ETA","ETA 12/0373",20,"LE002B","1359-CPD-0519","SSH_ETA.lab","D12 neu",5.3,5.9,"H+W",5.3,5300]
[]
[]
["Weich"]
[null,"TYP","Kopf","Gruppe","Artikelnr","ETA Code 1","ETA Code 2","ETA-\nKennbuchstabe","NAV-Bez1","NAV-Bez2","Zugtrag-\nfähigkeit [kN]","Fließ-\nmoment [Nm]","Auszieh-\nparameter [N/mm2]","Kopfdurchzieh-parameter [N/mm²] für 90 ° Sog Schrauben bei Scheibenkopf","für 45° od. 60° Verschraubung mit 60%","Kraft-vergleich [kN]","Fließ-\ngrenze [N/mm2]","Torsions-\nfestigkeit [Nm]\n(Bruchdrehmoment)","Einschraub\ndrehmoment [Nm]","Länge","DM","Dimension","Gewindelänge","Kopfdurch-messer","Kopf-Art [°]","Reibteil","Antrieb","Et Text 1 = Programm TEXT","Kopfgeo","Schaft","Gewinde","Oberfläche","Nummer Ü-Zeichen","ETA oder EN","ETA-Nummer","ETA-Jahreszahl","ETA-LE-Nummer","ETA-Überwachungsstelle","Etikettengröße","Programm"]
["slst_2_1","Essve CS-FT","countersunk","Essve Fullthread","1335740801200001","080x120/110","A0C 1A1 C1E","E","ESSVE C-FT  8,0 x 120/110","EG/KR+HSP/T40/YellWin500+ (SSH+Bit)",24.1,20.3,13.1,12.4,{"$f":"IF(C227=\"Scheibe\",N227*0.6,\"\")","v":""},{"$f":"X227*X227*N227","v":2790},950,25.8,8.6999999999999993,120,8,"8,0 x 120",110,15,90,null,"TX 40","RAPID® VOLLGEWINDE","Senkkopf, Unterkopfrippen",null,"EG-Vollgewinde, Halbspitze + Kernrippen","YellWin 500+","Z-9.1-656","ETA","ETA 12/0373",20,"LE005B","1359-CPD-0519","SSH_ETA.lab","D8",5.0999999999999996,"not relevant","H+W",5.0999999999999996,{"$f":"AR227*1000","v":5100}]
[null,"Essve CS-FT","countersunk","Essve Fullthread","1335740801400001","080x140/130","A0C 1A1 C1E","E","ESSVE C-FT  8,0 x 140/130","EG/KR+HSP/T40/YellWin500+ (SSH+Bit)",24.1,20.3,13.1,12.4,"",2790,950,25.8,8.6999999999999993,140,8,"8,0 x 140",130,15,90,null,"TX 40","RAPID® VOLLGEWINDE","Senkkopf, Unterkopfrippen",null,"EG-Vollgewinde, Halbspitze + Kernrippen","YellWin 500+","Z-9.1-656","ETA","ETA 12/0373",20,"LE005B","1359-CPD-0519","SSH_ETA.lab","D8",5.0999999999999996,"not relevant","H+W",5.0999999999999996,5100]
[null,"Essve CS-FT","countersunk","Essve Fullthread","1335740801600001","080x160/150","A0C 1A1 C1E","E","ESSVE C-FT  8,0 x 160/150","EG/KR+HSP/T40/YellWin500+ (SSH+Bit)",24.1,20.3,13.1,12.4,"",2790,950,25.8,8.6999999999999993,160,8,"8,0 x 160",150,15,90,null,"TX 40","RAPID® VOLLGEWINDE","Senkkopf, Unterkopfrippen",null,"EG-Vollgewinde, Halbspitze + Kernrippen","YellWin 500+","Z-9.1-656","ETA","ETA 12/0373",20,"LE005B","1359-CPD-0519","SSH_ETA.lab","D8",5.0999999999999996,"not relevant","H+W",5.0999999999999996,5100]
[null,"Essve CS-FT","countersunk","Essve Fullthread","1335740801800001","080x180/170","A0C 1A1 C1E","E","ESSVE C-FT  8,0 x 180/170","EG/KR+HSP/T40/YellWin500+ (SSH+Bit)",24.1,20.3,13.1,12.4,"",2790,950,25.8,8.6999999999999993,180,8,"8,0 x 180",170,15,90,null,"TX 40","RAPID® VOLLGEWINDE","Senkkopf, Unterkopfrippen",null,"EG-Vollgewinde, Halbspitze + Kernrippen","YellWin 500+","Z-9.1-656, Z-9.1-509","ETA","ETA 12/0373",20,"LE005B","1359-CPD-0519","SSH_ETA.lab","D8",5.0999999999999996,"not relevant","H+W",5.0999999999999996,5100]
[null,"Essve CS-FT","countersunk","Essve Fullthread","1335740802000001","080x200/190","A0C 1A1 C1E","E","ESSVE C-FT  8,0 x 200/190","EG/KR+HSP/T40/YellWin500+ (SSH+Bit)",24.1,20.3,13.1,12.4,"",2790,950,25.8,8.6999999999999993,200,8,"8,0 x 200",190,15,90,null,"TX 40","RAPID® VOLLGEWINDE","Senkkopf, Unterkopfrippen",null,"EG-Vollgewinde, Halbspitze + Kernrippen","YellWin 500+","Z-9.1-656, Z-9.1-509","ETA","ETA 12/0373",20,"LE005B","1359-CPD-0519","SSH_ETA.lab","D8",5.0999999999999996,"not relevant","H+W",5.0999999999999996,5100]
[null,"Essve CS-FT","countersunk","Essve Fullthread","1335740802200001","080x220/210","A0C 1A1 C1E","E","ESSVE C-FT  8,0 x 220/210","EG/KR+HSP/T40/YellWin500+ (SSH+Bit)",24.1,20.3,13.1,12.4,"",2790,950,25.8,8.6999999999999993,220,8,"8,0 x 220",210,15,90,null,"TX 40","RAPID® VOLLGEWINDE","Senkkopf, Unterkopfrippen",null,"EG-Vollgewinde, Halbspitze + Kernrippen","YellWin 500+","Z-9.1-656, Z-9.1-509","ETA","ETA 12/0373",20,"LE005B","1359-CPD-0519","SSH_ETA.lab","D8",5.0999999999999996,"not relevant","H+W",5.0999999999999996,5100]
[null,"Essve CS-FT","countersunk","Essve Fullthread","1335740802400001","080x240/230","A0C 1A1 C1E","E","ESSVE C-FT  8,0 x 240/230","EG/KR+HSP/T40/YellWin500+ (SSH+Bit)",24.1,20.3,13.1,12.4,"",2790,950,25.8,8.6999999999999993,240,8,"8,0 x 240",230,15,90,null,"TX 40","RAPID® VOLLGEWINDE","Senkkopf, Unterkopfrippen",null,"EG-Vollgewinde, Halbspitze + Kernrippen","YellWin 500+","Z-9.1-656, Z-9.1-509","ETA","ETA 12/0373",20,"LE005B","1359-CPD-0519","SSH_ETA.lab","D8",5.0999999999999996,"not relevant","H+W",5.0999999999999996,5100]
[null,"Essve CS-FT","countersunk","Essve Fullthread","1335740802600001","080x260/250","A0C 1A1 C1E","E","ESSVE C-FT  8,0 x 260/250","EG/KR+HSP/T40/YellWin500+ (SSH+Bit)",24.1,20.3,13.1,12.4,"",2790,950,25.8,8.6999999999999993,260,8,"8,0 x 260",250,15,90,null,"TX 40","RAPID® VOLLGEWINDE","Senkkopf, Unterkopfrippen",null,"EG-Vollgewinde, Halbspitze + Kernrippen","YellWin 500+","Z-9.1-656, Z-9.1-509","ETA","ETA 12/0373",20,"LE005B","1359-CPD-0519","SSH_ETA.lab","D8",5.0999999999999996,"not relevant","H+W",5.0999999999999996,5100]
[null,"Essve CS-FT","countersunk","Essve Fullthread","1335740802800001","080x280/270","A0C 1A1 C1E","E","ESSVE C-FT  8,0 x 280/270","EG/KR+HSP/T40/YellWin500+ (SSH+Bit)",24.1,20.3,13.1,12.4,"",2790,950,25.8,8.6999999999999993,280,8,"8,0 x 280",270,15,90,null,"TX 40","RAPID® VOLLGEWINDE","Senkkopf, Unterkopfrippen",null,"EG-Vollgewinde, Halbspitze + Kernrippen","YellWin 500+","Z-9.1-656, Z-9.1-509","ETA","ETA 12/0373",20,"LE005B","1359-CPD-0519","SSH_ETA.lab","D8",5.0999999999999996,"not relevant","H+W",5.0999999999999996,5100]
[null,"Essve CS-FT","countersunk","Essve Fullthread","1335740803000001","080x300/290","A0C 1A1 C1E","E","ESSVE C-FT  8,0 x 300/290","EG/KR+HSP/T40/YellWin500+ (SSH+Bit)",24.1,20.3,13.1,12.4,"",2790,950,25.8,8.6999999999999993,300,8,"8,0 x 300",290,15,90,null,"TX 40","RAPID® VOLLGEWINDE","Senkkopf, Unterkopfrippen",null,"EG-Vollgewinde, Halbspitze + Kernrippen","YellWin 500+","Z-9.1-656, Z-9.1-509","ETA","ETA 12/0373",20,"LE005B","1359-CPD-0519","SSH_ETA.lab","D8",5.0999999999999996,"not relevant","H+W",5.0999999999999996,5100]
[null,"Essve CS-FT","countersunk","Essve Fullthread","1335740803250001",null,null,null,"ESSVE C-FT  8,0 x 325/315","EG/KR+HSP/T40/YellWin500+ (SSH+Bit)",24.1,20.3,13.1,12.4,"",2790,950,25.8,8.6999999999999993,325,8,"8,0 x 325",315,15,90,null,"TX 40","RAPID® VOLLGEWINDE","Senkkopf, Unterkopfrippen",null,"EG-Vollgewinde, Halbspitze + Kernrippen","YellWin 500+",null,"ETA","ETA 12/0373",20,"LE005B","1359-CPD-0519",null,null,5.0999999999999996,"not relevant","H+W",5.0999999999999996,5100]
[null,"Essve CS-FT","countersunk","Essve Fullthread","1335740803500001","080x350/340","A0C 1A1 C1E","E","ESSVE C-FT  8,0 x 350/340","EG/KR+HSP/T40/YellWin500+ (SSH+Bit)",24.1,20.3,13.1,12.4,"",2790,950,25.8,8.6999999999999993,350,8,"8,0 x 350",340,15,90,null,"TX 40","RAPID® VOLLGEWINDE","Senkkopf, Unterkopfrippen",null,"EG-Vollgewinde, Halbspitze + Kernrippen","YellWin 500+","Z-9.1-656, Z-9.1-509","ETA","ETA 12/0373",20,"LE005B","1359-CPD-0519","SSH_ETA.lab","D8",5.0999999999999996,"not relevant","H+W",5.0999999999999996,5100]
[null,"Essve CS-FT","countersunk","Essve Fullthread","1335740803750001",null,null,null,"ESSVE C-FT  8,0 x 375/365","EG/KR+HSP/T40/YellWin500+ (SSH+Bit)",24.1,20.3,13.1,12.4,"",2790,950,25.8,8.6999999999999993,375,8,"8,0 x 375",365,15,90,null,"TX 40","RAPID® VOLLGEWINDE","Senkkopf, Unterkopfrippen",null,"EG-Vollgewinde, Halbspitze + Kernrippen","YellWin 500+",null,"ETA","ETA 12/0373",20,"LE005B","1359-CPD-0519",null,null,5.0999999999999996,"not relevant","H+W",5.0999999999999996,5100]
[null,"Essve CS-FT","countersunk","Essve Fullthread","1335740804000001","080x400/390","A0C 1A1 C1E","E","ESSVE C-FT  8,0 x 400/390","EG/KR+HSP/T40/YellWin500+ (SSH+Bit)",24.1,20.3,13.1,12.4,"",2790,950,25.8,8.6999999999999993,400,8,"8,0 x 400",390,15,90,null,"TX 40","RAPID® VOLLGEWINDE","Senkkopf, Unterkopfrippen",null,"EG-Vollgewinde, Halbspitze + Kernrippen","YellWin 500+","Z-9.1-656, Z-9.1-509","ETA","ETA 12/0373",20,"LE005B","1359-CPD-0519","SSH_ETA.lab","D8",5.0999999999999996,"not relevant","H+W",5.0999999999999996,5100]
[null,"Essve CS-FT","countersunk","Essve Fullthread","1335740804500001","080x450/427","A0C 1A1 C1E","E","ESSVE C-FT  8,0 x 450/427","EG/KR+HSP/T40/YellWin500+ (SSH+Bit)",24.1,20.3,13.1,12.4,"",2790,950,25.8,8.6999999999999993,450,8,"8,0 x 450",427,15,90,null,"TX 40","RAPID® VOLLGEWINDE","Senkkopf, Unterkopfrippen",null,"EG-Vollgewinde, Halbspitze + Kernrippen","YellWin 500+","Z-9.1-656, Z-9.1-509","ETA","ETA 12/0373",20,"LE005B","1359-CPD-0519","SSH_ETA.lab","D9",5.0999999999999996,"not relevant","H+W",5.0999999999999996,5100]
[null,"Essve CS-FT","countersunk","Essve Fullthread","1335740805000001","080x500/477","A0C 1A1 C1E","E","ESSVE C-FT  8,0 x 500/477","EG/KR+HSP/T40/YellWin500+ (SSH+Bit)",24.1,20.3,13.1,12.4,"",2790,950,25.8,8.6999999999999993,500,8,"8,0 x 500",477,15,90,null,"TX 40","RAPID® VOLLGEWINDE","Senkkopf, Unterkopfrippen",null,"EG-Vollgewinde, Halbspitze + Kernrippen","YellWin 500+",null,"ETA","ETA 12/0373",20,"LE005B","1359-CPD-0519","SSH_ETA.lab","D9",5.0999999999999996,"not relevant","H+W",5.0999999999999996,5100]
[null,"Essve CS-FT","countersunk","Essve Fullthread","1335740806000001","080x600/577","A0C 1A1 C1E","E","ESSVE C-FT  8,0 x 600/577","EG/KR+HSP/T40/YellWin500+ (SSH+Bit)",24.1,20.3,13.1,12.4,"",2790,950,25.8,8.6999999999999993,600,8,"8,0 x 600",577,15,90,null,"TX 40","RAPID® VOLLGEWINDE","Senkkopf, Unterkopfrippen",null,"EG-Vollgewinde, Halbspitze + Kernrippen","YellWin 500+",null,"ETA","ETA 12/0373",20,"LE005B","1359-CPD-0519","SSH_ETA.lab","D9",5.0999999999999996,"not relevant","H+W",5.0999999999999996,5100]
[null,"Essve CS-FT","countersunk","Essve Fullthread","1335741001200001","100x120/108","A0C 1A1 C1E","E","ESSVE C-FT  10,0 x 120/108","EG/KR+HSP/T50/YellWin500+ (SSH+Bit)",40,36.700000000000003,12.5,12.2,"",4175.45,950,55,15.6,120,10,"10,0 x 120",108,18.5,90,null,"TX 50","RAPID® VOLLGEWINDE","Senkkopf, Unterkopfrippen",null,"EG-Vollgewinde, Halbspitze + Kernrippen","YellWin 500+","Z-9.1-656","ETA","ETA 12/0373",20,"LE005B","1359-CPD-0519","SSH_ETA.lab","D8",6.2,"not relevant","H+W",6.2,6200]
[null,"Essve CS-FT","countersunk","Essve Fullthread","1335741001600001","100x160/148","A0C 1A1 C1E","E","ESSVE C-FT  10,0 x 160/148","EG/KR+HSP/T50/YellWin500+ (SSH+Bit)",40,36.700000000000003,12.5,12.2,"",4175.45,950,55,15.6,160,10,"10,0 x 160",148,18.5,90,null,"TX 50","RAPID® VOLLGEWINDE","Senkkopf, Unterkopfrippen",null,"EG-Vollgewinde, Halbspitze + Kernrippen","YellWin 500+","Z-9.1-656","ETA","ETA 12/0373",20,"LE005B","1359-CPD-0519","SSH_ETA.lab","D8",6.2,"not relevant","H+W",6.2,6200]
[null,"Essve CS-FT","countersunk","Essve Fullthread","1335741001800001","100x180/168","A0C 1A1 C1E","E","ESSVE C-FT  10,0 x 180/168","EG/KR+HSP/T50/YellWin500+ (SSH+Bit)",40,36.700000000000003,12.5,12.2,"",4175.45,950,55,15.6,180,10,"10,0 x 180",168,18.5,90,null,"TX 50","RAPID® VOLLGEWINDE","Senkkopf, Unterkopfrippen",null,"EG-Vollgewinde, Halbspitze + Kernrippen","YellWin 500+","Z-9.1-656, Z-9.1-509","ETA","ETA 12/0373",20,"LE005B","1359-CPD-0519","SSH_ETA.lab","D8",6.2,"not relevant","H+W",6.2,6200]
[null,"Essve CS-FT","countersunk","Essve Fullthread","1335741002000001","100x200/188","A0C 1A1 C1E","E","ESSVE C-FT  10,0 x 200/188","EG/KR+HSP/T50/YellWin500+ (SSH+Bit)",40,36.700000000000003,12.5,12.2,"",4175.45,950,55,15.6,200,10,"10,0 x 200",188,18.5,90,null,"TX 50","RAPID® VOLLGEWINDE","Senkkopf, Unterkopfrippen",null,"EG-Vollgewinde, Halbspitze + Kernrippen","YellWin 500+","Z-9.1-656, Z-9.1-509","ETA","ETA 12/0373",20,"LE005B","1359-CPD-0519","SSH_ETA.lab","D8",6.2,"not relevant","H+W",6.2,6200]
[null,"Essve CS-FT","countersunk","Essve Fullthread","1335741002200001","100x220/208","A0C 1A1 C1E","E","ESSVE C-FT  10,0 x 220/208","EG/KR+HSP/T50/YellWin500+ (SSH+Bit)",40,36.700000000000003,12.5,12.2,"",4175.45,950,55,15.6,220,10,"10,0 x 220",208,18.5,90,null,"TX 50","RAPID® VOLLGEWINDE","Senkkopf, Unterkopfrippen",null,"EG-Vollgewinde, Halbspitze + Kernrippen","YellWin 500+","Z-9.1-656, Z-9.1-509","ETA","ETA 12/0373",20,"LE005B","1359-CPD-0519","SSH_ETA.lab","D8",6.2,"not relevant","H+W",6.2,6200]
[null,"Essve CS-FT","countersunk","Essve Fullthread","1335741002400001","100x240/228","A0C 1A1 C1E","E","ESSVE C-FT  10,0 x 240/228","EG/KR+HSP/T50/YellWin500+ (SSH+Bit)",40,36.700000000000003,12.5,12.2,"",4175.45,950,55,15.6,240,10,"10,0 x 240",228,18.5,90,null,"TX 50","RAPID® VOLLGEWINDE","Senkkopf, Unterkopfrippen",null,"EG-Vollgewinde, Halbspitze + Kernrippen","YellWin 500+","Z-9.1-656, Z-9.1-509","ETA","ETA 12/0373",20,"LE005B","1359-CPD-0519","SSH_ETA.lab","D8",6.2,"not relevant","H+W",6.2,6200]
[null,"Essve CS-FT","countersunk","Essve Fullthread","1335741002600001","100x260/248","A0C 1A1 C1E","E","ESSVE C-FT  10,0 x 260/248","EG/KR+HSP/T50/YellWin500+ (SSH+Bit)",40,36.700000000000003,12.5,12.2,"",4175.45,950,55,15.6,260,10,"10,0 x 260",248,18.5,90,null,"TX 50","RAPID® VOLLGEWINDE","Senkkopf, Unterkopfrippen",null,"EG-Vollgewinde, Halbspitze + Kernrippen","YellWin 500+","Z-9.1-656, Z-9.1-509","ETA","ETA 12/0373",20,"LE005B","1359-CPD-0519","SSH_ETA.lab","D8",6.2,"not relevant","H+W",6.2,6200]
[null,"Essve CS-FT","countersunk","Essve Fullthread","1335741002800001","100x280/268","A0C 1A1 C1E","E","ESSVE C-FT  10,0 x 280/268","EG/KR+HSP/T50/YellWin500+ (SSH+Bit)",40,36.700000000000003,12.5,12.2,"",4175.45,950,55,15.6,280,10,"10,0 x 280",268,18.5,90,null,"TX 50","RAPID® VOLLGEWINDE","Senkkopf, Unterkopfrippen",null,"EG-Vollgewinde, Halbspitze + Kernrippen","YellWin 500+","Z-9.1-656, Z-9.1-509","ETA","ETA 12/0373",20,"LE005B","1359-CPD-0519","SSH_ETA.lab","D8",6.2,"not relevant","H+W",6.2,6200]
[null,"Essve CS-FT","countersunk","Essve Fullthread","1335741003000001","100x300/288","A0C 1A1 C1E","E","ESSVE C-FT  10,0 x 300/288","EG/KR+HSP/T50/YellWin500+ (SSH+Bit)",40,36.700000000000003,12.5,12.2,"",4175.45,950,55,15.6,300,10,"10,0 x 300",288,18.5,90,null,"TX 50","RAPID® VOLLGEWINDE","Senkkopf, Unterkopfrippen",null,"EG-Vollgewinde, Halbspitze + Kernrippen","YellWin 500+","Z-9.1-656, Z-9.1-509","ETA","ETA 12/0373",20,"LE005B","1359-CPD-0519","SSH_ETA.lab","D8",6.2,"not relevant","H+W",6.2,6200]
[null,"Essve CS-FT","countersunk","Essve Fullthread","1335741003250001",null,null,null,"ESSVE C-FT  10,0 x 325/301","EG/KR+HSP/T50/YellWin500+ (SSH+Bit)",40,36.700000000000003,12.5,12.2,"",4175.45,950,55,15.6,325,10,"10,0 x 325",301,18.5,90,null,"TX 50","RAPID® VOLLGEWINDE","Senkkopf, Unterkopfrippen",null,"EG-Vollgewinde, Halbspitze + Kernrippen","YellWin 500+",null,"ETA","ETA 12/0373",20,"LE005B","1359-CPD-0519",null,null,6.2,"not relevant","H+W",6.2,6200]
[null,"Essve CS-FT","countersunk","Essve Fullthread","1335741003500001","100x350/338","A0C 1A1 C1E","E","ESSVE C-FT  10,0 x 350/326","EG/KR+HSP/T50/YellWin500+ (SSH+Bit)",40,36.700000000000003,12.5,12.2,"",4175.45,950,55,15.6,350,10,"10,0 x 350",326,18.5,90,null,"TX 50","RAPID® VOLLGEWINDE","Senkkopf, Unterkopfrippen",null,"EG-Vollgewinde, Halbspitze + Kernrippen","YellWin 500+","Z-9.1-656, Z-9.1-509","ETA","ETA 12/0373",20,"LE005B","1359-CPD-0519","SSH_ETA.lab","D8",6.2,"not relevant","H+W",6.2,6200]
[null,"Essve CS-FT","countersunk","Essve Fullthread","1335741003750001",null,null,null,"ESSVE C-FT  10,0 x 375/351","EG/KR+HSP/T50/YellWin500+ (SSH+Bit)",40,36.700000000000003,12.5,12.2,"",4175.45,950,55,15.6,375,10,"10,0 x 375",351,18.5,90,null,"TX 50","RAPID® VOLLGEWINDE","Senkkopf, Unterkopfrippen",null,"EG-Vollgewinde, Halbspitze + Kernrippen","YellWin 500+",null,"ETA","ETA 12/0373",20,"LE005B","1359-CPD-0519",null,null,6.2,"not relevant","H+W",6.2,6200]
[null,"Essve CS-FT","countersunk","Essve Fullthread","1335741004000001","100x400/376","A0C 1A1 C1E","E","ESSVE C-FT  10,0 x 400/376","EG/KR+HSP/T50/YellWin500+ (SSH+Bit)",40,36.700000000000003,12.5,12.2,"",4175.45,950,55,15.6,400,10,"10,0 x 400",376,18.5,90,null,"TX 50","RAPID® VOLLGEWINDE","Senkkopf, Unterkopfrippen",null,"EG-Vollgewinde, Halbspitze + Kernrippen","YellWin 500+","Z-9.1-656, Z-9.1-509","ETA","ETA 12/0373",20,"LE005B","1359-CPD-0519","SSH_ETA.lab","D8",6.2,"not relevant","H+W",6.2,6200]
[null,"Essve CS-FT","countersunk","Essve Fullthread","1335741004500001","100x450/426 ","A0C 1A1 C1E","E","ESSVE C-FT  10,0 x 450/426","EG/KR+HSP/T50/YellWin500+ (SSH+Bit)",40,36.700000000000003,12.5,12.2,"",4175.45,950,55,15.6,450,10,"10,0 x 450",426,18.5,90,null,"TX 50","RAPID® VOLLGEWINDE","Senkkopf, Unterkopfrippen",null,"EG-Vollgewinde, Halbspitze + Kernrippen","YellWin 500+","Z-9.1-656, Z-9.1-509","ETA","ETA 12/0373",20,"LE005B","1359-CPD-0519","SSH_ETA.lab","D9",6.2,"not relevant","H+W",6.2,6200]
[null,"Essve CS-FT","countersunk","Essve Fullthread","1335741005000001","100x500/476","A0C 1A1 C1E","E","ESSVE C-FT  10,0 x 500/476","EG/KR+HSP/T50/YellWin500+ (SSH+Bit)",40,36.700000000000003,12.5,12.2,"",4175.45,950,55,15.6,500,10,"10,0 x 500",476,18.5,90,null,"TX 50","RAPID® VOLLGEWINDE","Senkkopf, Unterkopfrippen",null,"EG-Vollgewinde, Halbspitze + Kernrippen","YellWin 500+",null,"ETA","ETA 12/0373",20,"LE005B","1359-CPD-0519","SSH_ETA.lab","D9",6.2,"not relevant","H+W",6.2,6200]
[null,"Essve CS-FT","countersunk","Essve Fullthread","1335741006000001","100x600/576","A0C 1A1 C1E","E","ESSVE C-FT  10,0 x 600/576","EG/KR+HSP/T50/YellWin500+ (SSH+Bit)",40,36.700000000000003,12.5,12.2,{"$f":"IF(C259=\"Scheibe\",N259*0.6,\"\")","v":""},{"$f":"X259*X259*N259","v":4175.45},950,55,15.6,600,10,"10,0 x 600",576,18.5,90,null,"TX 50","RAPID® VOLLGEWINDE","Senkkopf, Unterkopfrippen",null,"EG-Vollgewinde, Halbspitze + Kernrippen","YellWin 500+",null,"ETA","ETA 12/0373",20,"LE005B","1359-CPD-0519","SSH_ETA.lab","D9",6.2,"not relevant","H+W",6.2,{"$f":"AR259*1000","v":6200}]
[null,"Essve CS-FT","countersunk","Essve Fullthread","1335741007000001",null,null,null,"ESSVE C-FT  10,0 x 700/676","EG/KR+HSP/T50/YellWin500+ (SSH+Bit)",40,36.700000000000003,12.5,12.2,"",4175.45,950,55,15.6,700,10,"10,0 x 700",676,18.5,90,null,"TX 50","RAPID® VOLLGEWINDE","Senkkopf, Unterkopfrippen",null,"EG-Vollgewinde, Halbspitze + Kernrippen","YellWin 500+",null,"ETA","ETA 12/0373",20,"LE005B","1359-CPD-0519",null,null,6.2,"not relevant","H+W",6.2,6200]
[null,"Essve CS-FT","countersunk","Essve Fullthread","1335741008000001",null,null,null,"ESSVE C-FT  10,0 x 800/776","EG/KR+HSP/T50/YellWin500+ (SSH+Bit)",40,36.700000000000003,12.5,12.2,"",4175.45,950,55,15.6,800,10,"10,0 x 800",776,18.5,90,null,"TX 50","RAPID® VOLLGEWINDE","Senkkopf, Unterkopfrippen",null,"EG-Vollgewinde, Halbspitze + Kernrippen","YellWin 500+",null,"ETA","ETA 12/0373",20,"LE005B","1359-CPD-0519",null,null,6.2,"not relevant","H+W",6.2,6200]
[null,"Essve CS-FT","countersunk","Essve Fullthread","1335741009990001",null,null,null,"ESSVE C-FT  10,0 x 1000/976","EG/KR+HSP/T50/YellWin500+ (SSH+Bit)",40,36.700000000000003,12.5,12.2,"",4175.45,950,55,15.6,1000,10,"10,0 x 1000",976,18.5,90,null,"TX 50","RAPID® VOLLGEWINDE","Senkkopf, Unterkopfrippen",null,"EG-Vollgewinde, Halbspitze + Kernrippen","YellWin 500+",null,"ETA","ETA 12/0373",20,"LE005B","1359-CPD-0519",null,null,6.2,"not relevant","H+W",6.2,6200]
[null,"Essve CS-FT","countersunk","Essve Fullthread","1335741202000001","120x200/180","C0C 1A1 C1E","E","ESSVE C-FT  12,0 x 200/180","EG/KR+HSP/T50/YellWin500+ (SSH+Bit)",46.7,48.5,11.2,11,"",4400,950,73,27.6,200,12,"12,0 x 200",180,20,90,null,"TX 50","RAPID® VOLLGEWINDE","Senkkopf, Unterkopfrippen",null,"EG-Vollgewinde, Halbspitze + Kernrippen","YellWin 500+",null,"ETA","ETA 12/0373",20,"LE005B","1359-CPD-0519","SSH_ETA.lab","D8",7,"not relevant","H+W",7,7000]
[null,"Essve CS-FT","countersunk","Essve Fullthread","1335741202200001","120x220/200","C0C 1A1 C1E","E","ESSVE C-FT  12,0 x 220/200","EG/KR+HSP/T50/YellWin500+ (SSH+Bit)",46.7,48.5,11.2,11,"",4400,950,73,27.6,220,12,"12,0 x 220",200,20,90,null,"TX 50","RAPID® VOLLGEWINDE","Senkkopf, Unterkopfrippen",null,"EG-Vollgewinde, Halbspitze + Kernrippen","YellWin 500+",null,"ETA","ETA 12/0373",20,"LE005B","1359-CPD-0519","SSH_ETA.lab","D8",7,"not relevant","H+W",7,7000]
[null,"Essve CS-FT","countersunk","Essve Fullthread","1335741202400001","120x240/220","C0C 1A1 C1E","E","ESSVE C-FT  12,0 x 240/220","EG/KR+HSP/T50/YellWin500+ (SSH+Bit)",46.7,48.5,11.2,11,"",4400,950,73,27.6,240,12,"12,0 x 240",220,20,90,null,"TX 50","RAPID® VOLLGEWINDE","Senkkopf, Unterkopfrippen",null,"EG-Vollgewinde, Halbspitze + Kernrippen","YellWin 500+",null,"ETA","ETA 12/0373",20,"LE005B","1359-CPD-0519","SSH_ETA.lab","D8",7,"not relevant","H+W",7,7000]
[null,"Essve CS-FT","countersunk","Essve Fullthread","1335741202600001","120x260/240","C0C 1A1 C1E","E","ESSVE C-FT  12,0 x 260/240","EG/KR+HSP/T50/YellWin500+ (SSH+Bit)",46.7,48.5,11.2,11,"",4400,950,73,27.6,260,12,"12,0 x 260",240,20,90,null,"TX 50","RAPID® VOLLGEWINDE","Senkkopf, Unterkopfrippen",null,"EG-Vollgewinde, Halbspitze + Kernrippen","YellWin 500+",null,"ETA","ETA 12/0373",20,"LE005B","1359-CPD-0519","SSH_ETA.lab","D8",7,"not relevant","H+W",7,7000]
[null,"Essve CS-FT","countersunk","Essve Fullthread","1335741202800001","120x280/260","C0C 1A1 C1E","E","ESSVE C-FT  12,0 x 280/260","EG/KR+HSP/T50/YellWin500+ (SSH+Bit)",46.7,48.5,11.2,11,"",4400,950,73,27.6,280,12,"12,0 x 280",260,20,90,null,"TX 50","RAPID® VOLLGEWINDE","Senkkopf, Unterkopfrippen",null,"EG-Vollgewinde, Halbspitze + Kernrippen","YellWin 500+",null,"ETA","ETA 12/0373",20,"LE005B","1359-CPD-0519","SSH_ETA.lab","D8",7,"not relevant","H+W",7,7000]
[null,"Essve CS-FT","countersunk","Essve Fullthread","1335741203000001","120x300/280","C0C 1A1 C1E","E","ESSVE C-FT  12,0 x 300/280","EG/KR+HSP/T50/YellWin500+ (SSH+Bit)",46.7,48.5,11.2,11,"",4400,950,73,27.6,300,12,"12,0 x 300",280,20,90,null,"TX 50","RAPID® VOLLGEWINDE","Senkkopf, Unterkopfrippen",null,"EG-Vollgewinde, Halbspitze + Kernrippen","YellWin 500+",null,"ETA","ETA 12/0373",20,"LE005B","1359-CPD-0519","SSH_ETA.lab","D8",7,"not relevant","H+W",7,7000]
[null,"Essve CS-FT","countersunk","Essve Fullthread","1335741203500001","120x350/330","C0C 1A1 C1E","E","ESSVE C-FT  12,0 x 350/330","EG/KR+HSP/T50/YellWin500+ (SSH+Bit)",46.7,48.5,11.2,11,"",4400,950,73,27.6,350,12,"12,0 x 350",330,20,90,null,"TX 50","RAPID® VOLLGEWINDE","Senkkopf, Unterkopfrippen",null,"EG-Vollgewinde, Halbspitze + Kernrippen","YellWin 500+",null,"ETA","ETA 12/0373",20,"LE005B","1359-CPD-0519","SSH_ETA.lab","D8",7,"not relevant","H+W",7,7000]
[null,"Essve CS-FT","countersunk","Essve Fullthread","1335741204000001","120x400/380","C0C 1A1 C1E","E","ESSVE C-FT  12,0 x 400/380","EG/KR+HSP/T50/YellWin500+ (SSH+Bit)",46.7,48.5,11.2,11,"",4400,950,73,27.6,400,12,"12,0 x 400",380,20,90,null,"TX 50","RAPID® VOLLGEWINDE","Senkkopf, Unterkopfrippen",null,"EG-Vollgewinde, Halbspitze + Kernrippen","YellWin 500+",null,"ETA","ETA 12/0373",20,"LE005B","1359-CPD-0519","SSH_ETA.lab","D8",7,"not relevant","H+W",7,7000]
[null,"Essve CS-FT","countersunk","Essve Fullthread","1335741205000001","120x500/480","C0C 1A1 C1E","E","ESSVE C-FT  12,0 x 500/480","EG/KR+HSP/T50/YellWin500+ (SSH+Bit)",46.7,48.5,11.2,11,"",4400,950,73,27.6,500,12,"12,0 x 500",480,20,90,null,"TX 50","RAPID® VOLLGEWINDE","Senkkopf, Unterkopfrippen",null,"EG-Vollgewinde, Halbspitze + Kernrippen","YellWin 500+",null,"ETA","ETA 12/0373",20,"LE005B","1359-CPD-0519","SSH_ETA.lab","D8",7,"not relevant","H+W",7,7000]
[null,"Essve CS-FT","countersunk","Essve Fullthread","1335741206000001","120x600/580","C0C 1A1 C1E","E","ESSVE C-FT  12,0 x 600/580","EG/KR+HSP/T50/YellWin500+ (SSH+Bit)",46.7,48.5,11.2,11,"",4400,950,73,27.6,600,12,"12,0 x 600",580,20,90,null,"TX 50","RAPID® VOLLGEWINDE","Senkkopf, Unterkopfrippen",null,"EG-Vollgewinde, Halbspitze + Kernrippen","YellWin 500+",null,"ETA","ETA 12/0373",20,"LE005B","1359-CPD-0519","SSH_ETA.lab","D8",7,"not relevant","H+W",7,7000]
[null,"Essve CS-FT","countersunk","Essve Fullthread","1335741207000001",null,null,null,"ESSVE C-FT  12,0 x 700/680","EG/KR+HSP/T50/YellWin500+ (SSH+Bit)",46.7,48.5,11.2,11,"",4400,950,73,27.6,700,12,"12,0 x 700",680,20,90,null,"TX 50","RAPID® VOLLGEWINDE","Senkkopf, Unterkopfrippen",null,"EG-Vollgewinde, Halbspitze + Kernrippen","YellWin 500+",null,"ETA","ETA 12/0373",20,"LE005B","1359-CPD-0519",null,null,7,"not relevant","H+W",7,7000]
[null,"Essve CS-FT","countersunk","Essve Fullthread","1335741208000001",null,null,null,"ESSVE C-FT  12,0 x 800/780","EG/KR+HSP/T50/YellWin500+ (SSH+Bit)",46.7,48.5,11.2,11,"",4400,950,73,27.6,800,12,"12,0 x 800",780,20,90,null,"TX 50","RAPID® VOLLGEWINDE","Senkkopf, Unterkopfrippen",null,"EG-Vollgewinde, Halbspitze + Kernrippen","YellWin 500+",null,"ETA","ETA 12/0373",20,"LE005B","1359-CPD-0519",null,null,7,"not relevant","H+W",7,7000]
[null,"Essve CS-FT","countersunk","Essve Fullthread","1335741209990001",null,null,null,"ESSVE C-FT  12,0 x 1000/980","EG/KR+HSP/T50/YellWin500+ (SSH+Bit)",46.7,48.5,11.2,11,"",4400,950,73,27.6,1000,12,"12,0 x 1000",980,20,90,null,"TX 50","RAPID® VOLLGEWINDE","Senkkopf, Unterkopfrippen",null,"EG-Vollgewinde, Halbspitze + Kernrippen","YellWin 500+",null,"ETA","ETA 12/0373",20,"LE005B","1359-CPD-0519",null,null,7,"not relevant","H+W",7,7000]
["slst_2_2","Essve CY-FT","cylinder","Essve Fullthread","1331740801200001","080x120/110","L0L 1A1 A0E","E","ESSVE C-FT  8,0X120/110","EG/KR/T40/YellWin500+ (SSH+Bit)",24.1,20.3,13.1,"0 (kein Kopfdurchzug)","",0,950,25.8,8.6999999999999993,120,8,"8,0 x 120",110,10.199999999999999,"kein kopfdurchzug",null,"TX 40","RAPID® VOLLGEWINDE","cylinderkopf",null,"EG-Vollgewinde + Kernrippen","YellWin 500+",null,"ETA","ETA 12/0373",20,"LE005B","1359-CPD-0519","SSH_ETA.lab","D10",5.0999999999999996,"not relevant","H+W",5.0999999999999996,5100]
[null,"Essve CY-FT","cylinder","Essve Fullthread","1331740801400001","080x140/130","L0L 1A1 A0E","E","ESSVE C-FT  8,0X140/130","EG/KR/T40/YellWin500+ (SSH+Bit)",24.1,20.3,13.1,"1 (kein Kopfdurchzug)","",0,950,25.8,8.6999999999999993,140,8,"8,0 x 140",130,10.199999999999999,"kein kopfdurchzug",null,"TX 40","RAPID® VOLLGEWINDE","cylinderkopf",null,"EG-Vollgewinde + Kernrippen","YellWin 500+",null,"ETA","ETA 12/0373",20,"LE005B","1359-CPD-0519","SSH_ETA.lab","D10",5.0999999999999996,"not relevant","H+W",5.0999999999999996,5100]
[null,"Essve CY-FT","cylinder","Essve Fullthread","1331740801600001","080x160/150","L0L 1A1 A0E","E","ESSVE C-FT  8,0X160/150","EG/KR/T40/YellWin500+ (SSH+Bit)",24.1,20.3,13.1,"2 (kein Kopfdurchzug)","",0,950,25.8,8.6999999999999993,160,8,"8,0 x 160",150,10.199999999999999,"kein kopfdurchzug",null,"TX 40","RAPID® VOLLGEWINDE","cylinderkopf",null,"EG-Vollgewinde + Kernrippen","YellWin 500+",null,"ETA","ETA 12/0373",20,"LE005B","1359-CPD-0519","SSH_ETA.lab","D10",5.0999999999999996,"not relevant","H+W",5.0999999999999996,5100]
[null,"Essve CY-FT","cylinder","Essve Fullthread","1331740801800001","080x180/170","L0L 1A1 A0E","E","ESSVE C-FT  8,0X180/170","EG/KR/T40/YellWin500+ (SSH+Bit)",24.1,20.3,13.1,"3 (kein Kopfdurchzug)","",0,950,25.8,8.6999999999999993,180,8,"8,0 x 180",170,10.199999999999999,"kein kopfdurchzug",null,"TX 40","RAPID® VOLLGEWINDE","cylinderkopf",null,"EG-Vollgewinde + Kernrippen","YellWin 500+",null,"ETA","ETA 12/0373",20,"LE005B","1359-CPD-0519","SSH_ETA.lab","D10",5.0999999999999996,"not relevant","H+W",5.0999999999999996,5100]
[null,"Essve CY-FT","cylinder","Essve Fullthread","1331740802000001","080x200/190","L0L 1A1 A0E","E","ESSVE C-FT  8,0X200/190","EG/KR/T40/YellWin500+ (SSH+Bit)",24.1,20.3,13.1,"4 (kein Kopfdurchzug)","",0,950,25.8,8.6999999999999993,200,8,"8,0 x 200",190,10.199999999999999,"kein kopfdurchzug",null,"TX 40","RAPID® VOLLGEWINDE","cylinderkopf",null,"EG-Vollgewinde + Kernrippen","YellWin 500+",null,"ETA","ETA 12/0373",20,"LE005B","1359-CPD-0519","SSH_ETA.lab","D10",5.0999999999999996,"not relevant","H+W",5.0999999999999996,5100]
[null,"Essve CY-FT","cylinder","Essve Fullthread","1331740802200001","080x220/210","L0L 1A1 A0E","E","ESSVE C-FT  8,0X220/210","EG/KR/T40/YellWin500+ (SSH+Bit)",24.1,20.3,13.1,"5 (kein Kopfdurchzug)","",0,950,25.8,8.6999999999999993,220,8,"8,0 x 220",210,10.199999999999999,"kein kopfdurchzug",null,"TX 40","RAPID® VOLLGEWINDE","cylinderkopf",null,"EG-Vollgewinde + Kernrippen","YellWin 500+",null,"ETA","ETA 12/0373",20,"LE005B","1359-CPD-0519","SSH_ETA.lab","D10",5.0999999999999996,"not relevant","H+W",5.0999999999999996,5100]
[null,"Essve CY-FT","cylinder","Essve Fullthread","1331740802400001","080x240/230","L0L 1A1 A0E","E","ESSVE C-FT  8,0X240/230","EG/KR/T40/YellWin500+ (SSH+Bit)",24.1,20.3,13.1,"6 (kein Kopfdurchzug)","",0,950,25.8,8.6999999999999993,240,8,"8,0 x 240",230,10.199999999999999,"kein kopfdurchzug",null,"TX 40","RAPID® VOLLGEWINDE","cylinderkopf",null,"EG-Vollgewinde + Kernrippen","YellWin 500+",null,"ETA","ETA 12/0373",20,"LE005B","1359-CPD-0519","SSH_ETA.lab","D10",5.0999999999999996,"not relevant","H+W",5.0999999999999996,5100]
[null,"Essve CY-FT","cylinder","Essve Fullthread","1331740802600001","080x260/250","L0L 1A1 A0E","E","ESSVE C-FT  8,0X260/250","EG/KR/T40/YellWin500+ (SSH+Bit)",24.1,20.3,13.1,"7 (kein Kopfdurchzug)","",0,950,25.8,8.6999999999999993,260,8,"8,0 x 260",250,10.199999999999999,"kein kopfdurchzug",null,"TX 40","RAPID® VOLLGEWINDE","cylinderkopf",null,"EG-Vollgewinde + Kernrippen","YellWin 500+",null,"ETA","ETA 12/0373",20,"LE005B","1359-CPD-0519","SSH_ETA.lab","D10",5.0999999999999996,"not relevant","H+W",5.0999999999999996,5100]
[null,"Essve CY-FT","cylinder","Essve Fullthread","1331740802800001","080x280/270","L0L 1A1 A0E","E","ESSVE C-FT  8,0X280/270","EG/KR/T40/YellWin500+ (SSH+Bit)",24.1,20.3,13.1,"8 (kein Kopfdurchzug)","",0,950,25.8,8.6999999999999993,280,8,"8,0 x 280",270,10.199999999999999,"kein kopfdurchzug",null,"TX 40","RAPID® VOLLGEWINDE","cylinderkopf",null,"EG-Vollgewinde + Kernrippen","YellWin 500+",null,"ETA","ETA 12/0373",20,"LE005B","1359-CPD-0519","SSH_ETA.lab","D10",5.0999999999999996,"not relevant","H+W",5.0999999999999996,5100]
[null,"Essve CY-FT","cylinder","Essve Fullthread","1331740803000001","080x300/290","L0L 1A1 A0E","E","ESSVE C-FT  8,0X300/290","EG/KR/T40/YellWin500+ (SSH+Bit)",24.1,20.3,13.1,"9 (kein Kopfdurchzug)","",0,950,25.8,8.6999999999999993,300,8,"8,0 x 300",290,10.199999999999999,"kein kopfdurchzug",null,"TX 40","RAPID® VOLLGEWINDE","cylinderkopf",null,"EG-Vollgewinde + Kernrippen","YellWin 500+",null,"ETA","ETA 12/0373",20,"LE005B","1359-CPD-0519","SSH_ETA.lab","D10",5.0999999999999996,"not relevant","H+W",5.0999999999999996,5100]
[null,"Essve CY-FT","cylinder","Essve Fullthread","1331740803250001",null,null,null,"ESSVE C-FT  8,0X325/315","EG/KR/T40/YellWin500+ (SSH+Bit)",24.1,20.3,13.1,"10 (kein Kopfdurchzug)","",0,950,25.8,8.6999999999999993,325,8,"8,0 x 325",315,10.199999999999999,"kein kopfdurchzug",null,"TX 40","RAPID® VOLLGEWINDE","cylinderkopf",null,"EG-Vollgewinde + Kernrippen","YellWin 500+",null,"ETA","ETA 12/0373",20,"LE005B","1359-CPD-0519",null,null,5.0999999999999996,"not relevant","H+W",5.0999999999999996,5100]
[null,"Essve CY-FT","cylinder","Essve Fullthread","1331740803500001","080x350/340","L0L 1A1 A0E","E","ESSVE C-FT  8,0X350/340","EG/KR/T40/YellWin500+ (SSH+Bit)",24.1,20.3,13.1,"11 (kein Kopfdurchzug)","",0,950,25.8,8.6999999999999993,350,8,"8,0 x 350",340,10.199999999999999,"kein kopfdurchzug",null,"TX 40","RAPID® VOLLGEWINDE","cylinderkopf",null,"EG-Vollgewinde + Kernrippen","YellWin 500+",null,"ETA","ETA 12/0373",20,"LE005B","1359-CPD-0519","SSH_ETA.lab","D10",5.0999999999999996,"not relevant","H+W",5.0999999999999996,5100]
[null,"Essve CY-FT","cylinder","Essve Fullthread","1331740803750001",null,null,null,"ESSVE C-FT  8,0X375/365","EG/KR/T40/YellWin500+ (SSH+Bit)",24.1,20.3,13.1,"12 (kein Kopfdurchzug)","",0,950,25.8,8.6999999999999993,375,8,"8,0 x 375",365,10.199999999999999,"kein kopfdurchzug",null,"TX 40","RAPID® VOLLGEWINDE","cylinderkopf",null,"EG-Vollgewinde + Kernrippen","YellWin 500+",null,"ETA","ETA 12/0373",20,"LE005B","1359-CPD-0519",null,null,5.0999999999999996,"not relevant","H+W",5.0999999999999996,5100]
[null,"Essve CY-FT","cylinder","Essve Fullthread","1331740804000001","080x400/390","L0L 1A1 A0E","E","ESSVE C-FT  8,0X400/390","EG/KR/T40/YellWin500+ (SSH+Bit)",24.1,20.3,13.1,"13 (kein Kopfdurchzug)","",0,950,25.8,8.6999999999999993,400,8,"8,0 x 400",390,10.199999999999999,"kein kopfdurchzug",null,"TX 40","RAPID® VOLLGEWINDE","cylinderkopf",null,"EG-Vollgewinde + Kernrippen","YellWin 500+",null,"ETA","ETA 12/0373",20,"LE005B","1359-CPD-0519","SSH_ETA.lab","D10",5.0999999999999996,"not relevant","H+W",5.0999999999999996,5100]
[null,"Essve CY-FT","cylinder","Essve Fullthread","1331740804500001","080x450/428","L0L 1A1 C0E","E","ESSVE C-FT  8,0 x 450/427","EG/KR+HSP/T40/YellWin500+ (SSH+Bit)",24.1,20.3,13.1,"14 (kein Kopfdurchzug)","",0,950,25.8,8.6999999999999993,450,8,"8,0 x 450",427,10.199999999999999,"kein kopfdurchzug",null,"TX 40","RAPID® VOLLGEWINDE","cylinderkopf",null,"EG-Vollgewinde, Halbspitze + Kernrippen","YellWin 500+",null,"ETA","ETA 12/0373",20,"LE005B","1359-CPD-0519","SSH_ETA.lab","D9",5.0999999999999996,"not relevant","H+W",5.0999999999999996,5100]
[null,"Essve CY-FT","cylinder","Essve Fullthread","1331740805000001","080x500/478 ","L0L 1A1 C0E","E","ESSVE C-FT  8,0 x 500/477","EG/KR+HSP/T40/YellWin500+ (SSH+Bit)",24.1,20.3,13.1,"15 (kein Kopfdurchzug)",{"$f":"IF(C291=\"Scheibe\",N291*0.6,\"\")","v":""},0,950,25.8,8.6999999999999993,500,8,"8,0 x 500",477,10.199999999999999,"kein kopfdurchzug",null,"TX 40","RAPID® VOLLGEWINDE","cylinderkopf",null,"EG-Vollgewinde, Halbspitze + Kernrippen","YellWin 500+",null,"ETA","ETA 12/0373",20,"LE005B","1359-CPD-0519","SSH_ETA.lab","D9",5.0999999999999996,"not relevant","H+W",5.0999999999999996,{"$f":"AR291*1000","v":5100}]
[null,"Essve CY-FT","cylinder","Essve Fullthread","1331740806000001","080x600/578","L0L 1A1 C0E","E","ESSVE C-FT  8,0 x 600/577","EG/KR+HSP/T40/YellWin500+ (SSH+Bit)",24.1,20.3,13.1,"16 (kein Kopfdurchzug)","",0,950,25.8,8.6999999999999993,600,8,"8,0 x 600",577,10.199999999999999,"kein kopfdurchzug",null,"TX 40","RAPID® VOLLGEWINDE","cylinderkopf",null,"EG-Vollgewinde, Halbspitze + Kernrippen","YellWin 500+",null,"ETA","ETA 12/0373",20,"LE005B","1359-CPD-0519","SSH_ETA.lab","D9",5.0999999999999996,"not relevant","H+W",5.0999999999999996,5100]
[null,"Essve CY-FT","cylinder","Essve Fullthread","1331741002000001",null,null,null,"ESSVE C-FT  10,0 x 200/188","EG/KR+HSP/T50/YellWin500+ (SSH+Bit)",40,36.700000000000003,12.5,"17 (kein Kopfdurchzug)","",0,950,55,15.6,200,10,"10,0 x 200",188,13.4,"kein kopfdurchzug",null,"TX 50","RAPID® VOLLGEWINDE","cylinderkopf",null,"EG-Vollgewinde, Halbspitze + Kernrippen","YellWin 500+",null,"ETA","ETA 12/0373",20,"LE005B","1359-CPD-0519",null,null,6.2,"not relevant","H+W",6.2,6200]
[null,"Essve CY-FT","cylinder","Essve Fullthread","1331741002400001",null,null,null,"ESSVE C-FT  10,0 x 240/228","EG/KR+HSP/T50/YellWin500+ (SSH+Bit)",40,36.700000000000003,12.5,"18 (kein Kopfdurchzug)","",0,950,55,15.6,240,10,"10,0 x 240",228,13.4,"kein kopfdurchzug",null,"TX 50","RAPID® VOLLGEWINDE","cylinderkopf",null,"EG-Vollgewinde, Halbspitze + Kernrippen","YellWin 500+",null,"ETA","ETA 12/0373",20,"LE005B","1359-CPD-0519",null,null,6.2,"not relevant","H+W",6.2,6200]
[null,"Essve CY-FT","cylinder","Essve Fullthread","1331741002600001",null,null,null,"ESSVE C-FT  10,0 x 260/248","EG/KR+HSP/T50/YellWin500+ (SSH+Bit)",40,36.700000000000003,12.5,"19 (kein Kopfdurchzug)","",0,950,55,15.6,260,10,"10,0 x 260",248,13.4,"kein kopfdurchzug",null,"TX 50","RAPID® VOLLGEWINDE","cylinderkopf",null,"EG-Vollgewinde, Halbspitze + Kernrippen","YellWin 500+",null,"ETA","ETA 12/0373",20,"LE005B","1359-CPD-0519",null,null,6.2,"not relevant","H+W",6.2,6200]
[null,"Essve CY-FT","cylinder","Essve Fullthread","1331741002800001",null,null,null,"ESSVE C-FT  10,0 x 280/268","EG/KR+HSP/T50/YellWin500+ (SSH+Bit)",40,36.700000000000003,12.5,"20 (kein Kopfdurchzug)","",0,950,55,15.6,280,10,"10,0 x 280",268,13.4,"kein kopfdurchzug",null,"TX 50","RAPID® VOLLGEWINDE","cylinderkopf",null,"EG-Vollgewinde, Halbspitze + Kernrippen","YellWin 500+",null,"ETA","ETA 12/0373",20,"LE005B","1359-CPD-0519",null,null,6.2,"not relevant","H+W",6.2,6200]
[null,"Essve CY-FT","cylinder","Essve Fullthread","1331741003000001",null,null,null,"ESSVE C-FT  10,0 x 300/288","EG/KR+HSP/T50/YellWin500+ (SSH+Bit)",40,36.700000000000003,12.5,"21 (kein Kopfdurchzug)","",0,950,55,15.6,300,10,"10,0 x 300",288,13.4,"kein kopfdurchzug",null,"TX 50","RAPID® VOLLGEWINDE","cylinderkopf",null,"EG-Vollgewinde, Halbspitze + Kernrippen","YellWin 500+",null,"ETA","ETA 12/0373",20,"LE005B","1359-CPD-0519",null,null,6.2,"not relevant","H+W",6.2,6200]
[null,"Essve CY-FT","cylinder","Essve Fullthread","1331741003250001",null,null,null,"ESSVE C-FT  10,0 x 325/301","EG/KR+HSP/T50/YellWin500+ (SSH+Bit)",40,36.700000000000003,12.5,"22 (kein Kopfdurchzug)","",0,950,55,15.6,325,10,"10,0 x 325",301,13.4,"kein kopfdurchzug",null,"TX 50","RAPID® VOLLGEWINDE","cylinderkopf",null,"EG-Vollgewinde, Halbspitze + Kernrippen","YellWin 500+",null,"ETA","ETA 12/0373",20,"LE005B","1359-CPD-0519",null,null,6.2,"not relevant","H+W",6.2,6200]
[null,"Essve CY-FT","cylinder","Essve Fullthread","1331741003500001",null,null,null,"ESSVE C-FT  10,0 x 350/326","EG/KR+HSP/T50/YellWin500+ (SSH+Bit)",40,36.700000000000003,12.5,"23 (kein Kopfdurchzug)","",0,950,55,15.6,350,10,"10,0 x 350",326,13.4,"kein kopfdurchzug",null,"TX 50","RAPID® VOLLGEWINDE","cylinderkopf",null,"EG-Vollgewinde, Halbspitze + Kernrippen","YellWin 500+",null,"ETA","ETA 12/0373",20,"LE005B","1359-CPD-0519",null,null,6.2,"not relevant","H+W",6.2,6200]
[null,"Essve CY-FT","cylinder","Essve Fullthread","1331741003750001",null,null,null,"ESSVE C-FT  10,0 x 375/351","EG/KR+HSP/T50/YellWin500+ (SSH+Bit)",40,36.700000000000003,12.5,"24 (kein Kopfdurchzug)","",0,950,55,15.6,375,10,"10,0 x 375",351,13.4,"kein kopfdurchzug",null,"TX 50","RAPID® VOLLGEWINDE","cylinderkopf",null,"EG-Vollgewinde, Halbspitze + Kernrippen","YellWin 500+",null,"ETA","ETA 12/0373",20,"LE005B","1359-CPD-0519",null,null,6.2,"not relevant","H+W",6.2,6200]
[null,"Essve CY-FT","cylinder","Essve Fullthread","1331741004000001",null,null,null,"ESSVE C-FT  10,0 x 400/376","EG/KR+HSP/T50/YellWin500+ (SSH+Bit)",40,36.700000000000003,12.5,"25 (kein Kopfdurchzug)","",0,950,55,15.6,400,10,"10,0 x 400",376,13.4,"kein kopfdurchzug",null,"TX 50","RAPID® VOLLGEWINDE","cylinderkopf",null,"EG-Vollgewinde, Halbspitze + Kernrippen","YellWin 500+",null,"ETA","ETA 12/0373",20,"LE005B","1359-CPD-0519",null,null,6.2,"not relevant","H+W",6.2,6200]
[null,"Essve CY-FT","cylinder","Essve Fullthread","1331741004500001","100x450/426 ","L0L 1A1 C0E","E","ESSVE C-FT  10,0 x 450/426","EG/KR+HSP/T50/YellWin500+ (SSH+Bit)",40,36.700000000000003,12.5,"26 (kein Kopfdurchzug)","",0,950,55,15.6,450,10,"10,0 x 450",426,13.4,"kein kopfdurchzug",null,"TX 50","RAPID® VOLLGEWINDE","cylinderkopf",null,"EG-Vollgewinde, Halbspitze + Kernrippen","YellWin 500+",null,"ETA","ETA 12/0373",20,"LE005B","1359-CPD-0519","SSH_ETA.lab","D9",6.2,"not relevant","H+W",6.2,6200]
[null,"Essve CY-FT","cylinder","Essve Fullthread","1331741005000001","100x500/476","L0L 1A1 C0E","E","ESSVE C-FT  10,0 x 500/476","EG/KR+HSP/T50/YellWin500+ (SSH+Bit)",40,36.700000000000003,12.5,"27 (kein Kopfdurchzug)","",0,950,55,15.6,500,10,"10,0 x 500",476,13.4,"kein kopfdurchzug",null,"TX 50","RAPID® VOLLGEWINDE","cylinderkopf",null,"EG-Vollgewinde, Halbspitze + Kernrippen","YellWin 500+",null,"ETA","ETA 12/0373",20,"LE005B","1359-CPD-0519","SSH_ETA.lab","D9",6.2,"not relevant","H+W",6.2,6200]
[null,"Essve CY-FT","cylinder","Essve Fullthread","1331741006000001","100x600/576","L0L 1A1 C0E","E","ESSVE C-FT  10,0 x 600/576","EG/KR+HSP/T50/YellWin500+ (SSH+Bit)",40,36.700000000000003,12.5,"28 (kein Kopfdurchzug)","",0,950,55,15.6,600,10,"10,0 x 600",576,13.4,"kein kopfdurchzug",null,"TX 50","RAPID® VOLLGEWINDE","cylinderkopf",null,"EG-Vollgewinde, Halbspitze + Kernrippen","YellWin 500+",null,"ETA","ETA 12/0373",20,"LE005B","1359-CPD-0519","SSH_ETA.lab","D9",6.2,"not relevant","H+W",6.2,6200]
[null,"Essve CY-FT","cylinder","Essve Fullthread","1331741007000001",null,null,null,"ESSVE C-FT  10,0 x 700/676","EG/KR+HSP/T50/YellWin500+ (SSH+Bit)",40,36.700000000000003,12.5,"29 (kein Kopfdurchzug)","",0,950,55,15.6,700,10,"10,0 x 700",676,13.4,"kein kopfdurchzug",null,"TX 50","RAPID® VOLLGEWINDE","cylinderkopf",null,"EG-Vollgewinde, Halbspitze + Kernrippen","YellWin 500+",null,"ETA","ETA 12/0373",20,"LE005B","1359-CPD-0519",null,null,6.2,"not relevant","H+W",6.2,6200]
[null,"Essve CY-FT","cylinder","Essve Fullthread","1331741008000001",null,null,null,"ESSVE C-FT  10,0 x 800/776","EG/KR+HSP/T50/YellWin500+ (SSH+Bit)",40,36.700000000000003,12.5,"30 (kein Kopfdurchzug)","",0,950,55,15.6,800,10,"10,0 x 800",776,13.4,"kein kopfdurchzug",null,"TX 50","RAPID® VOLLGEWINDE","cylinderkopf",null,"EG-Vollgewinde, Halbspitze + Kernrippen","YellWin 500+",null,"ETA","ETA 12/0373",20,"LE005B","1359-CPD-0519",null,null,6.2,"not relevant","H+W",6.2,6200]
[null,"Essve CY-FT","cylinder","Essve Fullthread","1331741009990001",null,null,null,"ESSVE C-FT  10,0 x 1000/976","EG/KR+HSP/T50/YellWin500+ (SSH+Bit)",40,36.700000000000003,12.5,"31 (kein Kopfdurchzug)","",0,950,55,15.6,1000,10,"10,0 x 1000",976,13.4,"kein kopfdurchzug",null,"TX 50","RAPID® VOLLGEWINDE","cylinderkopf",null,"EG-Vollgewinde, Halbspitze + Kernrippen","YellWin 500+",null,"ETA","ETA 12/0373",20,"LE005B","1359-CPD-0519",null,null,6.2,"not relevant","H+W",6.2,6200]
["slst_2_3","Essve CY-DT","cylinder","Essve double thrd.","5939710802400001","080x240/084+080","L1L 0B1 B0B","B","CY-DT  cylhd.  8X240/80+R/80","T40/BLUEWIN (Essve-package)",22,22.6,10.7,"0 (kein Kopfdurchzug)","",0,900,24.8,8.3000000000000007,240,8,"8,0 x 240",227.5,10.199999999999999,"kein kopfdurchzug","+R","TX 40","RAPID® Top-2-Roof","cylinderkopf","Reibteil","GG-Teilgewinde, Unterkopfstützgewinde","BlueWin",null,"ETA","ETA 12/0373",20,"LE002B","1359-CPD-0519","SSH_ETA.lab","D12 neu",5.3,5.9,"H+W",5.3,5300]
[null,"Essve CY-DT","cylinder","Essve double thrd.","5939710802600001","080x260/100+080","L1L 0B1 B0B","B","CY-DT  cylhd.  8X260/100+R/80","T40/BLUEWIN (Essve-package)",22,22.6,10.7,"1 (kein Kopfdurchzug)","",0,900,24.8,8.3000000000000007,260,8,"8,0 x 260",247.5,10.199999999999999,"kein kopfdurchzug","+R","TX 40","RAPID® Top-2-Roof","cylinderkopf","Reibteil","GG-Teilgewinde, Unterkopfstützgewinde","BlueWin",null,"ETA","ETA 12/0373",20,"LE002B","1359-CPD-0519","SSH_ETA.lab","D12 neu",5.3,5.9,"H+W",5.3,5300]
[null,"Essve CY-DT","cylinder","Essve double thrd.","5939710802800001","080x280/100+080","L1L 0B1 B0B","B","CY-DT  cylhd.  8X280/100+R/80","T40/BLUEWIN (Essve-package)",22,22.6,10.7,"2 (kein Kopfdurchzug)","",0,900,24.8,8.3000000000000007,280,8,"8,0 x 280",267.5,10.199999999999999,"kein kopfdurchzug","+R","TX 40","RAPID® Top-2-Roof","cylinderkopf","Reibteil","GG-Teilgewinde, Unterkopfstützgewinde","BlueWin",null,"ETA","ETA 12/0373",20,"LE002B","1359-CPD-0519","SSH_ETA.lab","D12 neu",5.3,5.9,"H+W",5.3,5300]
[null,"Essve CY-DT","cylinder","Essve double thrd.","5939710803000001","080x300/100+080","L1L 0B1 B0B","B","CY-DT  cylhd.  8X300/100+R/80","T40/BLUEWIN (Essve-package)",22,22.6,10.7,"3 (kein Kopfdurchzug)","",0,900,24.8,8.3000000000000007,300,8,"8,0 x 300",287.5,10.199999999999999,"kein kopfdurchzug","+R","TX 40","RAPID® Top-2-Roof","cylinderkopf","Reibteil","GG-Teilgewinde, Unterkopfstützgewinde","BlueWin",null,"ETA","ETA 12/0373",20,"LE002B","1359-CPD-0519","SSH_ETA.lab","D12 neu",5.3,5.9,"H+W",5.3,5300]
[null,"Essve CY-DT","cylinder","Essve double thrd.","5939710803200001","080x320/100+080","L1L 0B1 B0B","B","CY-DT  cylhd.  8X320/100+R/80","T40/BLUEWIN (Essve-package)",22,22.6,10.7,"4 (kein Kopfdurchzug)","",0,900,24.8,8.3000000000000007,320,8,"8,0 x 320",307.5,10.199999999999999,"kein kopfdurchzug","+R","TX 40","RAPID® Top-2-Roof","cylinderkopf","Reibteil","GG-Teilgewinde, Unterkopfstützgewinde","BlueWin",null,"ETA","ETA 12/0373",20,"LE002B","1359-CPD-0519","SSH_ETA.lab","D12 neu",5.3,5.9,"H+W",5.3,5300]
[null,"Essve CY-DT","cylinder","Essve double thrd.","5939710803400001","080x340/100+080","L1L 0B1 B0B","B","CY-DT  cylhd.  8X340/100+R/80","T40/BLUEWIN (Essve-package)",22,22.6,10.7,"5 (kein Kopfdurchzug)","",0,900,24.8,8.3000000000000007,340,8,"8,0 x 340",327.5,10.199999999999999,"kein kopfdurchzug","+R","TX 40","RAPID® Top-2-Roof","cylinderkopf","Reibteil","GG-Teilgewinde, Unterkopfstützgewinde","BlueWin",null,"ETA","ETA 12/0373",20,"LE002B","1359-CPD-0519","SSH_ETA.lab","D12 neu",5.3,5.9,"H+W",5.3,5300]
[null,"Essve CY-DT","cylinder","Essve double thrd.","5939710803600001","080x360/100+080","L1L 0B1 B0B","B","CY-DT  cylhd.  8X360/100+R/80","T40/BLUEWIN (Essve-package)",22,22.6,10.7,"6 (kein Kopfdurchzug)","",0,900,24.8,8.3000000000000007,360,8,"8,0 x 360",347.5,10.199999999999999,"kein kopfdurchzug","+R","TX 40","RAPID® Top-2-Roof","cylinderkopf","Reibteil","GG-Teilgewinde, Unterkopfstützgewinde","BlueWin",null,"ETA","ETA 12/0373",20,"LE002B","1359-CPD-0519","SSH_ETA.lab","D12 neu",5.3,5.9,"H+W",5.3,5300]
[null,"Essve CY-DT","cylinder","Essve double thrd.","5939710804000001","080x400/100+080","L1L 0B1 B0B","B","CY-DT  cylhd.  8X400/100+R/80","T40/BLUEWIN (Essve-package)",22,22.6,10.7,"7 (kein Kopfdurchzug)","",0,900,24.8,8.3000000000000007,400,8,"8,0 x 400",387.5,10.199999999999999,"kein kopfdurchzug","+R","TX 40","RAPID® Top-2-Roof","cylinderkopf","Reibteil","GG-Teilgewinde, Unterkopfstützgewinde","BlueWin",null,"ETA","ETA 12/0373",20,"LE002B","1359-CPD-0519","SSH_ETA.lab","D12 neu",5.3,5.9,"H+W",5.3,5300]
[null,"Essve CY-DT","cylinder","Essve double thrd.","5939710804500001","080x450/100+080","L1L 0B1 B0B","B","CY-DT  cylhd.  8X450/100+R/80","T40/BLUEWIN (Essve-package)",22,22.6,10.7,"8 (kein Kopfdurchzug)","",0,900,24.8,8.3000000000000007,450,8,"8,0 x 450",437.5,10.199999999999999,"kein kopfdurchzug","+R","TX 40","RAPID® Top-2-Roof","cylinderkopf","Reibteil","GG-Teilgewinde, Unterkopfstützgewinde","BlueWin",null,"ETA","ETA 12/0373",20,"LE002B","1359-CPD-0519","SSH_ETA.lab","D12 neu",5.3,5.9,"H+W",5.3,5300]

{"sheet":"Materialdaten_Holz","index":15,"n_rows":28,"n_cols":30,"rows_kept":28,"cut":false,"hidden":true,"merged":[[18,1,19,1],[18,3,19,3],[20,1,22,1],[20,3,22,3],[1,1,2,3],[1,4,1,15],[1,16,1,22],[1,23,1,29],[3,3,17,3],[4,1,5,1],[6,1,7,1],[10,1,13,1],[14,1,15,1],[16,1,17,1]]}
[]
[null,"Baustoff Holz",null,null,"NADELHOLZ",null,null,null,null,null,null,null,null,null,null,null,"BRETTSCHICHTHOLZ homogen",null,null,null,null,null,null,"BRETTSCHICHTHOLZ kombiniert"]
[null,null,null,null,"C14","C16","C18","C20","C22","C24","C27","C30","C35","C40","C45","C50","GL20h","GL22h","GL24h","GL26h","GL28h","GL30h","GL32h","GL20c","GL22c","GL24c","GL26c","GL28c","GL30c","GL32c"]
[null,"Biegefestigkeit","f m,k","N/mm²",14,16,18,20,22,24,27,30,35,40,45,50,20,22,24,26,28,30,32,20,22,24,26,28,30,32]
[null,"Zugfestigkeit","f t,0,k",null,8,10,11,12,13,14,16,18,21,24,27,30,16,17.600000000000001,19.2,20.8,22.3,24,25.6,15,16,17,19,19.5,19.5,19.5]
[null,null,"f t,90,k",null,0.4,0.4,0.4,0.4,0.4,0.4,0.4,0.4,0.4,0.4,0.4,0.4,0.5,0.5,0.5,0.5,0.5,0.5,0.5,0.5,0.5,0.5,0.5,0.5,0.5,0.5]
[null,"Druckfestigkeit","f c,0,k",null,16,17,18,19,20,21,22,23,25,26,27,29,20,22,24,26,28,30,32,18.5,20,21.5,23.5,24,24.5,24.5]
[null,null,"f c,90,k",null,2,2.2000000000000002,2.2000000000000002,2.2999999999999998,2.4,2.5,2.6,2.7,2.8,2.9,3.1,3.2,2.5,2.5,2.5,2.5,2.5,2.5,2.5,2.5,2.5,2.5,2.5,2.5,2.5,2.5]
[null,"Schubfestigkeit","f v,k",null,2.2999999999999998,2.2999999999999998,2.2999999999999998,2.2999999999999998,2.2999999999999998,2.2999999999999998,2.2999999999999998,2.2999999999999998,2.2999999999999998,2.2999999999999998,2.2999999999999998,2.2999999999999998,2.5,2.5,2.5,2.5,2.5,2.5,2.5,2.5,2.5,2.5,2.5,2.5,2.5,2.5]
[null,"Rollschubfestigkeit","f r,k",null,null,null,null,null,null,null,null,null,null,null,null,null,1.2,1.2,1.2,1.2,1.2,1.2,1.2,1.2,1.2,1.2,1.2,1.2,1.2,1.2]
[null,"Elastizitätsmodul","E 0,mean",null,7000,8000,9000,9500,10000,11000,11500,12000,13000,14000,15000,16000,8400,10500,11500,12100,12600,13600,14200,10400,10400,11000,12000,12500,13000,13500]
[null,null,"E 0.05",null,4700,5400,6000,6400,6700,7400,7700,8000,8700,9400,10000,10700,7000,8800,9600,10100,10500,11300,11800,8600,8600,9100,10000,10400,10800,11200]
[null,null,"E 90,mean",null,230,270,300,320,330,370,380,400,430,470,500,530,300,300,300,300,300,300,300,300,300,300,300,300,300,300]
[null,null,"E 90,.05",null,null,null,null,null,null,null,null,null,null,null,null,null,250,250,250,250,250,250,250,250,250,250,250,250,250,250]
[null,"Schubmodul","G mean",null,440,500,560,590,630,690,720,750,810,880,940,1000,650,650,650,650,650,650,650,650,650,650,650,650,650,650]
[null,null,"G 05",null,null,null,null,null,null,null,null,null,null,null,null,null,540,540,540,540,540,540,540,540,540,540,540,540,540,540]
[null,"Rollschubmodul","G r,mean",null,null,null,null,null,null,null,null,null,null,null,null,null,65,65,65,65,65,65,65,65,65,65,65,65,65,65]
[null,null,"G r,05",null,null,null,null,null,null,null,null,null,null,null,null,null,54,54,54,54,54,54,54,54,54,54,54,54,54,54]
[null,"Rohdichte","r k","kg/m³",290,310,320,330,340,350,370,380,400,420,440,460,340,370,385,405,425,430,440,355,355,365,385,390,390,400]
[null,null,"r mean",null,350,370,380,390,410,420,450,460,480,500,520,550,370,410,420,445,460,480,490,390,390,400,420,420,430,440]
[null,"Abbrandrate","β 0",null,0.65,0.65,0.65,0.65,0.65,0.65,0.65,0.65,0.65,0.65,0.65,0.65,0.65,0.65,0.65,0.65,0.65,0.65,0.65,0.65,0.65,0.65,0.65,0.65,0.65,0.65]
[null,null,"β n",null,0.8,0.8,0.8,0.8,0.8,0.8,0.8,0.8,0.8,0.8,0.8,0.8,0.7,0.7,0.7,0.7,0.7,0.7,0.7,0.7,0.7,0.7,0.7,0.7,0.7,0.7]
[null,null,"k fi",null,1.25,1.25,1.25,1.25,1.25,1.25,1.25,1.25,1.25,1.25,1.25,1.25,1.1499999999999999,1.1499999999999999,1.1499999999999999,1.1499999999999999,1.1499999999999999,1.1499999999999999,1.1499999999999999,1.1499999999999999,1.1499999999999999,1.1499999999999999,1.1499999999999999,1.1499999999999999,1.1499999999999999,1.1499999999999999]
[]
[]
[]
[]
[null,"Frei Schraubenlänge "]